{"text_format":"3","workbook":"xlsx","n_sheets":8,"sheets":["Sheet1","CCA_Form_A_Part_I","CCA_Form_A_Part_II","CCA Form A Part II (1)","CCA Form A Part II (2)","CCA Form A Part II (3)","CCA Form A Part II (4)","CCA Form A Part II (5)"],"not_rendered":{"images":1,"macros":1},"read":"whole","date_system":"1900"}

{"sheet":"Sheet1","index":0,"n_rows":79,"n_cols":27,"rows_kept":79,"merged":[[0,0,0,13],[1,0,1,2],[2,0,2,2],[3,0,3,2],[4,7,4,9],[4,10,4,12],[5,0,5,2],[5,3,5,6],[6,0,6,2],[6,3,6,6],[7,0,7,2],[7,3,7,4],[8,0,8,2],[8,3,8,5],[8,6,8,8],[8,9,8,11],[8,12,8,14],[8,15,8,17],[8,18,8,20],[8,21,8,23],[8,24,8,26],[9,0,9,1],[9,3,9,4],[9,6,9,7],[9,9,9,10],[9,12,9,13],[9,15,9,16],[9,18,9,19],[9,21,9,22],[9,24,9,25],[10,0,10,1],[10,3,10,4],[10,6,10,7],[10,9,10,10],[10,12,10,13],[10,15,10,16],[10,18,10,19],[10,21,10,22],[10,24,10,25],[11,0,11,1],[11,3,11,4],[11,6,11,7],[11,9,11,10],[11,12,11,13],[11,15,11,16],[11,18,11,19],[11,21,11,22],[11,24,11,25],[12,0,12,1],[12,3,12,4],[12,6,12,7],[12,9,12,10],[12,12,12,13],[12,15,12,16],[12,18,12,19],[12,21,12,22],[12,24,12,25],[13,0,13,1],[13,3,13,4],[13,6,13,7],[13,9,13,10],[13,12,13,13],[13,15,13,16],[13,18,13,19],[13,21,13,22],[13,24,13,25],[14,0,14,1],[14,3,14,4],[14,6,14,7],[14,9,14,10],[14,12,14,13],[14,15,14,16],[14,18,14,19],[14,21,14,22],[14,24,14,25],[15,0,15,1],[15,3,15,4],[15,6,15,7],[15,9,15,10],[15,12,15,13],[15,15,15,16],[15,18,15,19],[15,21,15,22],[15,24,15,25],[16,0,16,11],[17,0,17,2],[20,3,20,4],[21,3,21,4],[22,3,22,4],[23,3,23,4],[24,3,24,4],[25,3,25,4],[26,3,26,4],[27,3,27,4],[28,3,28,4],[29,3,29,4],[30,3,30,4],[31,3,31,4],[32,3,32,4],[33,3,33,4],[34,3,34,4],[35,3,35,4],[36,3,36,4],[37,3,37,4],[38,3,38,4],[39,3,39,4],[40,3,40,4],[41,3,41,4],[42,3,42,4],[43,3,43,4],[44,3,44,4],[45,3,45,4],[46,3,46,4],[47,3,47,4],[48,3,48,4],[49,3,49,4],[50,3,50,4],[51,3,51,4],[52,3,52,4],[53,3,53,4]]}
["ST. JOSEPH'S COLLEGE, MOOLAMATTOM (AUTONOMOUS)"]
["Academic Year: ",null,null,"2024-2025"]
["Course Code:",null,null,"MG1DSCMA101"]
["Semester:",null,null,1]
["CCA Component Type (Theory/Practical):",null,null,"THEORY"]
["Name of the Course:",null,null,"INTRODUCTION TO WEB DESIGNING\t\t"]
["Number of Course Outcomes:",null,null,9]
["Total Marks Allocated for CCA",null,null,{"$f":"C16+F16+I16+L16+O16+R16+U16+X16+AA16","v":0}]
["CO 1",null,null,"CO 2",null,null,"CO 3",null,null,"CO 4",null,null,"CO 5",null,null,"CO 6",null,null,"CO 7",null,null,"CO 8",null,null,"CO 9"]
["Evaluation Method(s) Used",null,"Marks Allocated","Evaluation Method(s) Used",null," Marks Allocated","Evaluation Method(s) Used",null,"Marks Allocated","Evaluation Method(s) Used",null," Marks Allocated","Evaluation Method(s) Used",null," Marks Allocated","Evaluation Method(s) Used",null," Marks Allocated","Evaluation Method(s) Used",null," Marks Allocated","Evaluation Method(s) Used",null," Marks Allocated","Evaluation Method(s) Used",null," Marks Allocated"]
[]
[]
[]
[]
[]
["TOTAL",null,{"$f":"SUM(C11:C15)","v":0},"TOTAL",null,{"$f":"SUM(F11:F15)","v":0},"TOTAL",null,{"$f":"SUM(I11:I15)","v":0},"TOTAL",null,{"$f":"SUM(L11:L15)","v":0},"TOTAL",null,{"$f":"SUM(O11:O15)","v":0},"TOTAL",null,{"$f":"SUM(R11:R15)","v":0},"TOTAL",null,{"$f":"SUM(U11:U15)","v":0},"TOTAL",null,{"$f":"SUM(X11:X15)","v":0},"TOTAL",null,{"$f":"SUM(AA11:AA15)","v":0}]
["Enter 'NA' if this CO does not come under the selected CCA Component Type"]
["Total Number of Students:",null,null,60]
["SL. No.","Register Number","Name of the Student"]
[1]
[2]
[3]
[4]
[5]
[6]
[7]
[8]
[9]
[10]
[11]
[12]
[13]
[14]
[15]
[16]
[17]
[18]
[19]
[20]
[21]
[22]
[23]
[24]
[25]
[26]
[27]
[28]
[29]
[30]
[31]
[32]
[33]
[34]
[35]
[36]
[37]
[38]
[39]
[40]
[41]
[42]
[43]
[44]
[45]
[46]
[47]
[48]
[49]
[50]
[51]
[52]
[53]
[54]
[55]
[56]
[57]
[58]
[59]
[60]

{"sheet":"CCA_Form_A_Part_I","index":1,"n_rows":72,"n_cols":57,"rows_kept":72,"merged":[[0,0,0,56],[1,0,1,56],[2,0,2,1],[3,0,3,1],[3,4,3,5],[4,0,4,1],[5,0,5,1],[5,3,5,5],[5,9,5,11],[5,15,5,17],[5,21,5,23],[5,27,5,29],[5,33,5,35],[5,39,5,41],[5,45,5,47],[5,51,5,53],[6,0,7,0],[6,1,7,1],[6,2,7,2],[6,8,7,8],[6,14,7,14],[6,20,7,20],[6,26,7,26],[6,32,7,32],[6,38,7,38],[6,44,7,44],[6,50,7,50],[6,56,7,56],[69,0,69,56],[70,0,70,56],[71,0,71,56]]}
["ST. JOSEPH'S COLLEGE, MOOLAMATTOM (AUTONOMOUS)"]
["CCA Form A: Part I"]
["Academic Year",null,{"$f":"Sheet1!D2","v":"2024-2025"}]
["Course Code:",null,{"$f":"Sheet1!D3","v":"MG1DSCMA101"}]
["Semester:",null,{"$f":"Sheet1!D4","v":1}]
["CCA Component Type (Theory/Practical):",null,{"$f":"Sheet1!D5","v":"THEORY"},"CO 1",{"$nulls":5},"CO 2",{"$nulls":5},"CO 3",{"$nulls":5},"CO 4",{"$nulls":5},"CO 5",{"$nulls":5},"CO 6",{"$nulls":5},"CO 7",{"$nulls":5},"CO 8",{"$nulls":5},"CO 9"]
["SL. No.","Register Number","Name of the Student",{"$f":"IF(ISBLANK(Sheet1!A11),\" \",Sheet1!A11)","v":" "},{"$f":"IF(ISBLANK(Sheet1!A12),\" \",Sheet1!A12)","v":" "},{"$f":"IF(ISBLANK(Sheet1!A13),\" \",Sheet1!A13)","v":" "},{"$f":"IF(ISBLANK(Sheet1!A14),\" \",Sheet1!A14)","v":" "},{"$f":"IF(ISBLANK(Sheet1!A15),\" \",Sheet1!A15)","v":" "},"Marks Obtained in CO 1",{"$f":"IF(ISBLANK(Sheet1!D11),\" \",Sheet1!D11)","v":" "},{"$f":"IF(ISBLANK(Sheet1!D12),\" \",Sheet1!D12)","v":" "},{"$f":"IF(ISBLANK(Sheet1!D13),\" \",Sheet1!D13)","v":" "},{"$f":"IF(ISBLANK(Sheet1!D14),\" \",Sheet1!D14)","v":" "},{"$f":"IF(ISBLANK(Sheet1!D15),\" \",Sheet1!D15)","v":" "},"Marks Obtained in CO 2",{"$f":"IF(ISBLANK(Sheet1!G11),\" \",Sheet1!G11)","v":" "},{"$f":"IF(ISBLANK(Sheet1!G12),\" \",Sheet1!G12)","v":" "},{"$f":"IF(ISBLANK(Sheet1!G13),\" \",Sheet1!G13)","v":" "},{"$f":"IF(ISBLANK(Sheet1!G14),\" \",Sheet1!G14)","v":" "},{"$f":"IF(ISBLANK(Sheet1!G15),\" \",Sheet1!G15)","v":" "},"Marks Obtained in CO 3",{"$f":"IF(ISBLANK(Sheet1!J11),\" \",Sheet1!J11)","v":" "},{"$f":"IF(ISBLANK(Sheet1!J12),\" \",Sheet1!J12)","v":" "},{"$f":"IF(ISBLANK(Sheet1!J13),\" \",Sheet1!J13)","v":" "},{"$f":"IF(ISBLANK(Sheet1!J14),\" \",Sheet1!J14)","v":" "},{"$f":"IF(ISBLANK(Sheet1!J15),\" \",Sheet1!J15)","v":" "},"Marks Obtained in CO 4",{"$f":"IF(ISBLANK(Sheet1!M11),\" \",Sheet1!M11)","v":" "},{"$f":"IF(ISBLANK(Sheet1!M12),\" \",Sheet1!M12)","v":" "},{"$f":"IF(ISBLANK(Sheet1!M13),\" \",Sheet1!M13)","v":" "},{"$f":"IF(ISBLANK(Sheet1!M14),\" \",Sheet1!M14)","v":" "},{"$f":"IF(ISBLANK(Sheet1!M15),\" \",Sheet1!M15)","v":" "},"Marks Obtained in CO 5",{"$f":"IF(ISBLANK(Sheet1!P11),\" \",Sheet1!P11)","v":" "},{"$f":"IF(ISBLANK(Sheet1!P12),\" \",Sheet1!P12)","v":" "},{"$f":"IF(ISBLANK(Sheet1!P13),\" \",Sheet1!P13)","v":" "},{"$f":"IF(ISBLANK(Sheet1!P14),\" \",Sheet1!P14)","v":" "},{"$f":"IF(ISBLANK(Sheet1!P15),\" \",Sheet1!P15)","v":" "},"Marks Obtained in CO 6",{"$f":"IF(ISBLANK(Sheet1!S11),\" \",Sheet1!S11)","v":" "},{"$f":"IF(ISBLANK(Sheet1!S12),\" \",Sheet1!S12)","v":" "},{"$f":"IF(ISBLANK(Sheet1!S13),\" \",Sheet1!S13)","v":" "},{"$f":"IF(ISBLANK(Sheet1!S14),\" \",Sheet1!S14)","v":" "},{"$f":"IF(ISBLANK(Sheet1!S15),\" \",Sheet1!S15)","v":" "},"Marks Obtained in CO 7",{"$f":"IF(ISBLANK(Sheet1!V11),\" \",Sheet1!V11)","v":" "},{"$f":"IF(ISBLANK(Sheet1!V12),\" \",Sheet1!V12)","v":" "},{"$f":"IF(ISBLANK(Sheet1!V13),\" \",Sheet1!V13)","v":" "},{"$f":"IF(ISBLANK(Sheet1!V14),\" \",Sheet1!V14)","v":" "},{"$f":"IF(ISBLANK(Sheet1!V15),\" \",Sheet1!V15)","v":" "},"Marks Obtained in CO 8",{"$f":"IF(ISBLANK(Sheet1!Y11),\" \",Sheet1!Y11)","v":" "},{"$f":"IF(ISBLANK(Sheet1!Y12),\" \",Sheet1!Y12)","v":" "},{"$f":"IF(ISBLANK(Sheet1!Y13),\" \",Sheet1!Y13)","v":" "},{"$f":"IF(ISBLANK(Sheet1!Y14),\" \",Sheet1!Y14)","v":" "},{"$f":"IF(ISBLANK(Sheet1!Y15),\" \",Sheet1!Y15)","v":" "},"Marks Obtained in CO 9"]
[{"$nulls":3},{"$f":"IF(ISBLANK(Sheet1!C11),\" \",Sheet1!C11)","v":" "},{"$f":"IF(ISBLANK(Sheet1!C12),\" \",Sheet1!C12)","v":" "},{"$f":"IF(ISBLANK(Sheet1!C13),\" \",Sheet1!C13)","v":" "},{"$f":"IF(ISBLANK(Sheet1!C14),\" \",Sheet1!C14)","v":" "},{"$f":"IF(ISBLANK(Sheet1!C15),\" \",Sheet1!C15)","v":" "},null,{"$f":"IF(ISBLANK(Sheet1!F11),\" \",Sheet1!F11)","v":" "},{"$f":"IF(ISBLANK(Sheet1!F12),\" \",Sheet1!F12)","v":" "},{"$f":"IF(ISBLANK(Sheet1!F13),\" \",Sheet1!F13)","v":" "},{"$f":"IF(ISBLANK(Sheet1!F14),\" \",Sheet1!F14)","v":" "},{"$f":"IF(ISBLANK(Sheet1!F15),\" \",Sheet1!F15)","v":" "},null,{"$f":"IF(ISBLANK(Sheet1!I11),\" \",Sheet1!I11)","v":" "},{"$f":"IF(ISBLANK(Sheet1!I12),\" \",Sheet1!I12)","v":" "},{"$f":"IF(ISBLANK(Sheet1!I13),\" \",Sheet1!I13)","v":" "},{"$f":"IF(ISBLANK(Sheet1!I14),\" \",Sheet1!I14)","v":" "},{"$f":"IF(ISBLANK(Sheet1!I15),\" \",Sheet1!I15)","v":" "},null,{"$f":"IF(ISBLANK(Sheet1!L11),\" \",Sheet1!L11)","v":" "},{"$f":"IF(ISBLANK(Sheet1!L12),\" \",Sheet1!L12)","v":" "},{"$f":"IF(ISBLANK(Sheet1!L13),\" \",Sheet1!L13)","v":" "},{"$f":"IF(ISBLANK(Sheet1!L14),\" \",Sheet1!L14)","v":" "},{"$f":"IF(ISBLANK(Sheet1!L15),\" \",Sheet1!L15)","v":" "},null,{"$f":"IF(ISBLANK(Sheet1!O11),\" \",Sheet1!O11)","v":" "},{"$f":"IF(ISBLANK(Sheet1!O12),\" \",Sheet1!O12)","v":" "},{"$f":"IF(ISBLANK(Sheet1!O13),\" \",Sheet1!O13)","v":" "},{"$f":"IF(ISBLANK(Sheet1!O14),\" \",Sheet1!O14)","v":" "},{"$f":"IF(ISBLANK(Sheet1!O15),\" \",Sheet1!O15)","v":" "},null,{"$f":"IF(ISBLANK(Sheet1!R11),\" \",Sheet1!R11)","v":" "},{"$f":"IF(ISBLANK(Sheet1!R12),\" \",Sheet1!R12)","v":" "},{"$f":"IF(ISBLANK(Sheet1!R13),\" \",Sheet1!R13)","v":" "},{"$f":"IF(ISBLANK(Sheet1!R14),\" \",Sheet1!R14)","v":" "},{"$f":"IF(ISBLANK(Sheet1!R15),\" \",Sheet1!R15)","v":" "},null,{"$f":"IF(ISBLANK(Sheet1!U11),\" \",Sheet1!U11)","v":" "},{"$f":"IF(ISBLANK(Sheet1!U12),\" \",Sheet1!U12)","v":" "},{"$f":"IF(ISBLANK(Sheet1!U13),\" \",Sheet1!U13)","v":" "},{"$f":"IF(ISBLANK(Sheet1!U14),\" \",Sheet1!U14)","v":" "},{"$f":"IF(ISBLANK(Sheet1!U15),\" \",Sheet1!U15)","v":" "},null,{"$f":"IF(ISBLANK(Sheet1!X11),\" \",Sheet1!X11)","v":" "},{"$f":"IF(ISBLANK(Sheet1!X12),\" \",Sheet1!X12)","v":" "},{"$f":"IF(ISBLANK(Sheet1!X13),\" \",Sheet1!X13)","v":" "},{"$f":"IF(ISBLANK(Sheet1!X14),\" \",Sheet1!X14)","v":" "},{"$f":"IF(ISBLANK(Sheet1!X15),\" \",Sheet1!X15)","v":" "},null,{"$f":"IF(ISBLANK(Sheet1!AA11),\" \",Sheet1!AA11)","v":" "},{"$f":"IF(ISBLANK(Sheet1!AA12),\" \",Sheet1!AA12)","v":" "},{"$f":"IF(ISBLANK(Sheet1!AA13),\" \",Sheet1!AA13)","v":" "},{"$f":"IF(ISBLANK(Sheet1!AA14),\" \",Sheet1!AA14)","v":" "},{"$f":"IF(ISBLANK(Sheet1!AA15),\" \",Sheet1!AA15)","v":" "}]
[{"$f":"IF(ISBLANK(Sheet1!A20),\" \",Sheet1!A20)","v":1},{"$f":"IF(ISBLANK(Sheet1!B20),\" \",Sheet1!B20)","v":" "},{"$f":"IF(ISBLANK(Sheet1!C20),\" \",Sheet1!C20)","v":" "},{"$nulls":5},{"$f":"D9+E9+F9+G9+H9","v":{"v":0,"d":"0.00"}},{"$nulls":5},{"$f":"J9+K9+L9+M9+N9","v":{"v":0,"d":"0.00"}},{"$nulls":5},{"$f":"SUM(P9:T9)","v":{"v":0,"d":"0.00"}},{"$nulls":5},{"$f":"V9+W9+X9+Y9+Z9","v":{"v":0,"d":"0.00"}},{"$nulls":5},{"$f":"AB9+AC9+AD9+AE9+AF9","v":{"v":0,"d":"0.00"}},{"$nulls":5},{"$f":"AH9+AI9+AJ9+AK9+AL9","v":{"v":0,"d":"0.00"}},{"$nulls":5},{"$f":"AN9+AO9+AP9+AQ9+AR9","v":{"v":0,"d":"0.00"}},{"$nulls":5},{"$f":"AT9+AU9+AV9+AW9+AX9","v":{"v":0,"d":"0.00"}},{"$nulls":5},{"$f":"AZ9+BA9+BB9+BC9+BD9","v":{"v":0,"d":"0.00"}}]
[{"$f":"IF(ISBLANK(Sheet1!A21),\" \",Sheet1!A21)","v":2},{"$f":"IF(ISBLANK(Sheet1!B21),\" \",Sheet1!B21)","v":" "},{"$f":"IF(ISBLANK(Sheet1!C21),\" \",Sheet1!C21)","v":" "},{"$nulls":5},{"v":0,"d":"0.00"},{"$nulls":5},{"v":0,"d":"0.00"},{"$nulls":5},{"$f":"P10+Q10+R10+S10+T10","v":{"v":0,"d":"0.00"}},{"$nulls":5},{"v":0,"d":"0.00"},{"$nulls":5},{"v":0,"d":"0.00"},{"$nulls":5},{"v":0,"d":"0.00"},{"$nulls":5},{"v":0,"d":"0.00"},{"$nulls":5},{"v":0,"d":"0.00"},{"$nulls":5},{"v":0,"d":"0.00"}]
[{"$f":"IF(ISBLANK(Sheet1!A22),\" \",Sheet1!A22)","v":3},{"$f":"IF(ISBLANK(Sheet1!B22),\" \",Sheet1!B22)","v":" "},{"$f":"IF(ISBLANK(Sheet1!C22),\" \",Sheet1!C22)","v":" "},{"$nulls":5},{"v":0,"d":"0.00"},{"$nulls":5},{"v":0,"d":"0.00"},{"$nulls":5},{"v":0,"d":"0.00"},{"$nulls":5},{"v":0,"d":"0.00"},{"$nulls":5},{"v":0,"d":"0.00"},{"$nulls":5},{"v":0,"d":"0.00"},{"$nulls":5},{"v":0,"d":"0.00"},{"$nulls":5},{"v":0,"d":"0.00"},{"$nulls":5},{"v":0,"d":"0.00"}]
[{"$f":"IF(ISBLANK(Sheet1!A23),\" \",Sheet1!A23)","v":4},{"$f":"IF(ISBLANK(Sheet1!B23),\" \",Sheet1!B23)","v":" "},{"$f":"IF(ISBLANK(Sheet1!C23),\" \",Sheet1!C23)","v":" "},{"$nulls":5},{"v":0,"d":"0.00"},{"$nulls":5},{"v":0,"d":"0.00"},{"$nulls":5},{"v":0,"d":"0.00"},{"$nulls":5},{"v":0,"d":"0.00"},{"$nulls":5},{"v":0,"d":"0.00"},{"$nulls":5},{"v":0,"d":"0.00"},{"$nulls":5},{"v":0,"d":"0.00"},{"$nulls":5},{"v":0,"d":"0.00"},{"$nulls":5},{"v":0,"d":"0.00"}]
[{"$f":"IF(ISBLANK(Sheet1!A24),\" \",Sheet1!A24)","v":5},{"$f":"IF(ISBLANK(Sheet1!B24),\" \",Sheet1!B24)","v":" "},{"$f":"IF(ISBLANK(Sheet1!C24),\" \",Sheet1!C24)","v":" "},{"$nulls":5},{"v":0,"d":"0.00"},{"$nulls":5},{"v":0,"d":"0.00"},{"$nulls":5},{"v":0,"d":"0.00"},{"$nulls":5},{"v":0,"d":"0.00"},{"$nulls":5},{"v":0,"d":"0.00"},{"$nulls":5},{"v":0,"d":"0.00"},{"$nulls":5},{"v":0,"d":"0.00"},{"$nulls":5},{"v":0,"d":"0.00"},{"$nulls":5},{"v":0,"d":"0.00"}]
[{"$f":"IF(ISBLANK(Sheet1!A25),\" \",Sheet1!A25)","v":6},{"$f":"IF(ISBLANK(Sheet1!B25),\" \",Sheet1!B25)","v":" "},{"$f":"IF(ISBLANK(Sheet1!C25),\" \",Sheet1!C25)","v":" "},{"$nulls":5},{"v":0,"d":"0.00"},{"$nulls":5},{"v":0,"d":"0.00"},{"$nulls":5},{"v":0,"d":"0.00"},{"$nulls":5},{"v":0,"d":"0.00"},{"$nulls":5},{"v":0,"d":"0.00"},{"$nulls":5},{"v":0,"d":"0.00"},{"$nulls":5},{"v":0,"d":"0.00"},{"$nulls":5},{"v":0,"d":"0.00"},{"$nulls":5},{"v":0,"d":"0.00"}]
[{"$f":"IF(ISBLANK(Sheet1!A26),\" \",Sheet1!A26)","v":7},{"$f":"IF(ISBLANK(Sheet1!B26),\" \",Sheet1!B26)","v":" "},{"$f":"IF(ISBLANK(Sheet1!C26),\" \",Sheet1!C26)","v":" "},{"$nulls":5},{"v":0,"d":"0.00"},{"$nulls":5},{"v":0,"d":"0.00"},{"$nulls":5},{"v":0,"d":"0.00"},{"$nulls":5},{"v":0,"d":"0.00"},{"$nulls":5},{"v":0,"d":"0.00"},{"$nulls":5},{"v":0,"d":"0.00"},{"$nulls":5},{"v":0,"d":"0.00"},{"$nulls":5},{"v":0,"d":"0.00"},{"$nulls":5},{"v":0,"d":"0.00"}]
[{"$f":"IF(ISBLANK(Sheet1!A27),\" \",Sheet1!A27)","v":8},{"$f":"IF(ISBLANK(Sheet1!B27),\" \",Sheet1!B27)","v":" "},{"$f":"IF(ISBLANK(Sheet1!C27),\" \",Sheet1!C27)","v":" "},{"$nulls":5},{"v":0,"d":"0.00"},{"$nulls":5},{"v":0,"d":"0.00"},{"$nulls":5},{"v":0,"d":"0.00"},{"$nulls":5},{"v":0,"d":"0.00"},{"$nulls":5},{"v":0,"d":"0.00"},{"$nulls":5},{"v":0,"d":"0.00"},{"$nulls":5},{"v":0,"d":"0.00"},{"$nulls":5},{"v":0,"d":"0.00"},{"$nulls":5},{"v":0,"d":"0.00"}]
[{"$f":"IF(ISBLANK(Sheet1!A28),\" \",Sheet1!A28)","v":9},{"$f":"IF(ISBLANK(Sheet1!B28),\" \",Sheet1!B28)","v":" "},{"$f":"IF(ISBLANK(Sheet1!C28),\" \",Sheet1!C28)","v":" "},{"$nulls":5},{"v":0,"d":"0.00"},{"$nulls":5},{"v":0,"d":"0.00"},{"$nulls":5},{"v":0,"d":"0.00"},{"$nulls":5},{"v":0,"d":"0.00"},{"$nulls":5},{"v":0,"d":"0.00"},{"$nulls":5},{"v":0,"d":"0.00"},{"$nulls":5},{"v":0,"d":"0.00"},{"$nulls":5},{"v":0,"d":"0.00"},{"$nulls":5},{"v":0,"d":"0.00"}]
[{"$f":"IF(ISBLANK(Sheet1!A29),\" \",Sheet1!A29)","v":10},{"$f":"IF(ISBLANK(Sheet1!B29),\" \",Sheet1!B29)","v":" "},{"$f":"IF(ISBLANK(Sheet1!C29),\" \",Sheet1!C29)","v":" "},{"$nulls":5},{"v":0,"d":"0.00"},{"$nulls":5},{"v":0,"d":"0.00"},{"$nulls":5},{"v":0,"d":"0.00"},{"$nulls":5},{"v":0,"d":"0.00"},{"$nulls":5},{"v":0,"d":"0.00"},{"$nulls":5},{"v":0,"d":"0.00"},{"$nulls":5},{"v":0,"d":"0.00"},{"$nulls":5},{"v":0,"d":"0.00"},{"$nulls":5},{"v":0,"d":"0.00"}]
[{"$f":"IF(ISBLANK(Sheet1!A30),\" \",Sheet1!A30)","v":11},{"$f":"IF(ISBLANK(Sheet1!B30),\" \",Sheet1!B30)","v":" "},{"$f":"IF(ISBLANK(Sheet1!C30),\" \",Sheet1!C30)","v":" "},{"$nulls":5},{"v":0,"d":"0.00"},{"$nulls":5},{"v":0,"d":"0.00"},{"$nulls":5},{"v":0,"d":"0.00"},{"$nulls":5},{"v":0,"d":"0.00"},{"$nulls":5},{"v":0,"d":"0.00"},{"$nulls":5},{"v":0,"d":"0.00"},{"$nulls":5},{"v":0,"d":"0.00"},{"$nulls":5},{"v":0,"d":"0.00"},{"$nulls":5},{"v":0,"d":"0.00"}]
[{"$f":"IF(ISBLANK(Sheet1!A31),\" \",Sheet1!A31)","v":12},{"$f":"IF(ISBLANK(Sheet1!B31),\" \",Sheet1!B31)","v":" "},{"$f":"IF(ISBLANK(Sheet1!C31),\" \",Sheet1!C31)","v":" "},{"$nulls":5},{"v":0,"d":"0.00"},{"$nulls":5},{"v":0,"d":"0.00"},{"$nulls":5},{"v":0,"d":"0.00"},{"$nulls":5},{"v":0,"d":"0.00"},{"$nulls":5},{"v":0,"d":"0.00"},{"$nulls":5},{"v":0,"d":"0.00"},{"$nulls":5},{"v":0,"d":"0.00"},{"$nulls":5},{"v":0,"d":"0.00"},{"$nulls":5},{"v":0,"d":"0.00"}]
[{"$f":"IF(ISBLANK(Sheet1!A32),\" \",Sheet1!A32)","v":13},{"$f":"IF(ISBLANK(Sheet1!B32),\" \",Sheet1!B32)","v":" "},{"$f":"IF(ISBLANK(Sheet1!C32),\" \",Sheet1!C32)","v":" "},{"$nulls":5},{"v":0,"d":"0.00"},{"$nulls":5},{"v":0,"d":"0.00"},{"$nulls":5},{"v":0,"d":"0.00"},{"$nulls":5},{"v":0,"d":"0.00"},{"$nulls":5},{"v":0,"d":"0.00"},{"$nulls":5},{"v":0,"d":"0.00"},{"$nulls":5},{"v":0,"d":"0.00"},{"$nulls":5},{"v":0,"d":"0.00"},{"$nulls":5},{"v":0,"d":"0.00"}]
[{"$f":"IF(ISBLANK(Sheet1!A33),\" \",Sheet1!A33)","v":14},{"$f":"IF(ISBLANK(Sheet1!B33),\" \",Sheet1!B33)","v":" "},{"$f":"IF(ISBLANK(Sheet1!C33),\" \",Sheet1!C33)","v":" "},{"$nulls":5},{"v":0,"d":"0.00"},{"$nulls":5},{"v":0,"d":"0.00"},{"$nulls":5},{"v":0,"d":"0.00"},{"$nulls":5},{"v":0,"d":"0.00"},{"$nulls":5},{"v":0,"d":"0.00"},{"$nulls":5},{"v":0,"d":"0.00"},{"$nulls":5},{"v":0,"d":"0.00"},{"$nulls":5},{"v":0,"d":"0.00"},{"$nulls":5},{"v":0,"d":"0.00"}]
[{"$f":"IF(ISBLANK(Sheet1!A34),\" \",Sheet1!A34)","v":15},{"$f":"IF(ISBLANK(Sheet1!B34),\" \",Sheet1!B34)","v":" "},{"$f":"IF(ISBLANK(Sheet1!C34),\" \",Sheet1!C34)","v":" "},{"$nulls":5},{"v":0,"d":"0.00"},{"$nulls":5},{"v":0,"d":"0.00"},{"$nulls":5},{"v":0,"d":"0.00"},{"$nulls":5},{"v":0,"d":"0.00"},{"$nulls":5},{"v":0,"d":"0.00"},{"$nulls":5},{"v":0,"d":"0.00"},{"$nulls":5},{"v":0,"d":"0.00"},{"$nulls":5},{"v":0,"d":"0.00"},{"$nulls":5},{"v":0,"d":"0.00"}]
[{"$f":"IF(ISBLANK(Sheet1!A35),\" \",Sheet1!A35)","v":16},{"$f":"IF(ISBLANK(Sheet1!B35),\" \",Sheet1!B35)","v":" "},{"$f":"IF(ISBLANK(Sheet1!C35),\" \",Sheet1!C35)","v":" "},{"$nulls":5},{"v":0,"d":"0.00"},{"$nulls":5},{"v":0,"d":"0.00"},{"$nulls":5},{"v":0,"d":"0.00"},{"$nulls":5},{"v":0,"d":"0.00"},{"$nulls":5},{"v":0,"d":"0.00"},{"$nulls":5},{"v":0,"d":"0.00"},{"$nulls":5},{"v":0,"d":"0.00"},{"$nulls":5},{"v":0,"d":"0.00"},{"$nulls":5},{"v":0,"d":"0.00"}]
[{"$f":"IF(ISBLANK(Sheet1!A36),\" \",Sheet1!A36)","v":17},{"$f":"IF(ISBLANK(Sheet1!B36),\" \",Sheet1!B36)","v":" "},{"$f":"IF(ISBLANK(Sheet1!C36),\" \",Sheet1!C36)","v":" "},{"$nulls":5},{"v":0,"d":"0.00"},{"$nulls":5},{"v":0,"d":"0.00"},{"$nulls":5},{"v":0,"d":"0.00"},{"$nulls":5},{"v":0,"d":"0.00"},{"$nulls":5},{"v":0,"d":"0.00"},{"$nulls":5},{"v":0,"d":"0.00"},{"$nulls":5},{"v":0,"d":"0.00"},{"$nulls":5},{"v":0,"d":"0.00"},{"$nulls":5},{"v":0,"d":"0.00"}]
[{"$f":"IF(ISBLANK(Sheet1!A37),\" \",Sheet1!A37)","v":18},{"$f":"IF(ISBLANK(Sheet1!B37),\" \",Sheet1!B37)","v":" "},{"$f":"IF(ISBLANK(Sheet1!C37),\" \",Sheet1!C37)","v":" "},{"$nulls":5},{"v":0,"d":"0.00"},{"$nulls":5},{"v":0,"d":"0.00"},{"$nulls":5},{"v":0,"d":"0.00"},{"$nulls":5},{"v":0,"d":"0.00"},{"$nulls":5},{"v":0,"d":"0.00"},{"$nulls":5},{"v":0,"d":"0.00"},{"$nulls":5},{"v":0,"d":"0.00"},{"$nulls":5},{"v":0,"d":"0.00"},{"$nulls":5},{"v":0,"d":"0.00"}]
[{"$f":"IF(ISBLANK(Sheet1!A38),\" \",Sheet1!A38)","v":19},{"$f":"IF(ISBLANK(Sheet1!B38),\" \",Sheet1!B38)","v":" "},{"$f":"IF(ISBLANK(Sheet1!C38),\" \",Sheet1!C38)","v":" "},{"$nulls":5},{"v":0,"d":"0.00"},{"$nulls":5},{"v":0,"d":"0.00"},{"$nulls":5},{"v":0,"d":"0.00"},{"$nulls":5},{"v":0,"d":"0.00"},{"$nulls":5},{"v":0,"d":"0.00"},{"$nulls":5},{"v":0,"d":"0.00"},{"$nulls":5},{"v":0,"d":"0.00"},{"$nulls":5},{"v":0,"d":"0.00"},{"$nulls":5},{"v":0,"d":"0.00"}]
[{"$f":"IF(ISBLANK(Sheet1!A39),\" \",Sheet1!A39)","v":20},{"$f":"IF(ISBLANK(Sheet1!B39),\" \",Sheet1!B39)","v":" "},{"$f":"IF(ISBLANK(Sheet1!C39),\" \",Sheet1!C39)","v":" "},{"$nulls":5},{"v":0,"d":"0.00"},{"$nulls":5},{"v":0,"d":"0.00"},{"$nulls":5},{"v":0,"d":"0.00"},{"$nulls":5},{"v":0,"d":"0.00"},{"$nulls":5},{"v":0,"d":"0.00"},{"$nulls":5},{"v":0,"d":"0.00"},{"$nulls":5},{"v":0,"d":"0.00"},{"$nulls":5},{"v":0,"d":"0.00"},{"$nulls":5},{"v":0,"d":"0.00"}]
[{"$f":"IF(ISBLANK(Sheet1!A40),\" \",Sheet1!A40)","v":21},{"$f":"IF(ISBLANK(Sheet1!B40),\" \",Sheet1!B40)","v":" "},{"$f":"IF(ISBLANK(Sheet1!C40),\" \",Sheet1!C40)","v":" "},{"$nulls":5},{"v":0,"d":"0.00"},{"$nulls":5},{"v":0,"d":"0.00"},{"$nulls":5},{"v":0,"d":"0.00"},{"$nulls":5},{"v":0,"d":"0.00"},{"$nulls":5},{"v":0,"d":"0.00"},{"$nulls":5},{"v":0,"d":"0.00"},{"$nulls":5},{"v":0,"d":"0.00"},{"$nulls":5},{"v":0,"d":"0.00"},{"$nulls":5},{"v":0,"d":"0.00"}]
[{"$f":"IF(ISBLANK(Sheet1!A41),\" \",Sheet1!A41)","v":22},{"$f":"IF(ISBLANK(Sheet1!B41),\" \",Sheet1!B41)","v":" "},{"$f":"IF(ISBLANK(Sheet1!C41),\" \",Sheet1!C41)","v":" "},{"$nulls":5},{"v":0,"d":"0.00"},{"$nulls":5},{"v":0,"d":"0.00"},{"$nulls":5},{"v":0,"d":"0.00"},{"$nulls":5},{"v":0,"d":"0.00"},{"$nulls":5},{"v":0,"d":"0.00"},{"$nulls":5},{"v":0,"d":"0.00"},{"$nulls":5},{"v":0,"d":"0.00"},{"$nulls":5},{"v":0,"d":"0.00"},{"$nulls":5},{"v":0,"d":"0.00"}]
[{"$f":"IF(ISBLANK(Sheet1!A42),\" \",Sheet1!A42)","v":23},{"$f":"IF(ISBLANK(Sheet1!B42),\" \",Sheet1!B42)","v":" "},{"$f":"IF(ISBLANK(Sheet1!C42),\" \",Sheet1!C42)","v":" "},{"$nulls":5},{"v":0,"d":"0.00"},{"$nulls":5},{"v":0,"d":"0.00"},{"$nulls":5},{"v":0,"d":"0.00"},{"$nulls":5},{"v":0,"d":"0.00"},{"$nulls":5},{"v":0,"d":"0.00"},{"$nulls":5},{"v":0,"d":"0.00"},{"$nulls":5},{"v":0,"d":"0.00"},{"$nulls":5},{"v":0,"d":"0.00"},{"$nulls":5},{"v":0,"d":"0.00"}]
[{"$f":"IF(ISBLANK(Sheet1!A43),\" \",Sheet1!A43)","v":24},{"$f":"IF(ISBLANK(Sheet1!B43),\" \",Sheet1!B43)","v":" "},{"$f":"IF(ISBLANK(Sheet1!C43),\" \",Sheet1!C43)","v":" "},{"$nulls":5},{"v":0,"d":"0.00"},{"$nulls":5},{"v":0,"d":"0.00"},{"$nulls":5},{"v":0,"d":"0.00"},{"$nulls":5},{"v":0,"d":"0.00"},{"$nulls":5},{"v":0,"d":"0.00"},{"$nulls":5},{"v":0,"d":"0.00"},{"$nulls":5},{"v":0,"d":"0.00"},{"$nulls":5},{"v":0,"d":"0.00"},{"$nulls":5},{"v":0,"d":"0.00"}]
[{"$f":"IF(ISBLANK(Sheet1!A44),\" \",Sheet1!A44)","v":25},{"$f":"IF(ISBLANK(Sheet1!B44),\" \",Sheet1!B44)","v":" "},{"$f":"IF(ISBLANK(Sheet1!C44),\" \",Sheet1!C44)","v":" "},{"$nulls":5},{"v":0,"d":"0.00"},{"$nulls":5},{"v":0,"d":"0.00"},{"$nulls":5},{"v":0,"d":"0.00"},{"$nulls":5},{"v":0,"d":"0.00"},{"$nulls":5},{"v":0,"d":"0.00"},{"$nulls":5},{"v":0,"d":"0.00"},{"$nulls":5},{"v":0,"d":"0.00"},{"$nulls":5},{"v":0,"d":"0.00"},{"$nulls":5},{"v":0,"d":"0.00"}]
[{"$f":"IF(ISBLANK(Sheet1!A45),\" \",Sheet1!A45)","v":26},{"$f":"IF(ISBLANK(Sheet1!B45),\" \",Sheet1!B45)","v":" "},{"$f":"IF(ISBLANK(Sheet1!C45),\" \",Sheet1!C45)","v":" "},{"$nulls":5},{"v":0,"d":"0.00"},{"$nulls":5},{"v":0,"d":"0.00"},{"$nulls":5},{"v":0,"d":"0.00"},{"$nulls":5},{"v":0,"d":"0.00"},{"$nulls":5},{"v":0,"d":"0.00"},{"$nulls":5},{"v":0,"d":"0.00"},{"$nulls":5},{"v":0,"d":"0.00"},{"$nulls":5},{"v":0,"d":"0.00"},{"$nulls":5},{"v":0,"d":"0.00"}]
[{"$f":"IF(ISBLANK(Sheet1!A46),\" \",Sheet1!A46)","v":27},{"$f":"IF(ISBLANK(Sheet1!B46),\" \",Sheet1!B46)","v":" "},{"$f":"IF(ISBLANK(Sheet1!C46),\" \",Sheet1!C46)","v":" "},{"$nulls":5},{"v":0,"d":"0.00"},{"$nulls":5},{"v":0,"d":"0.00"},{"$nulls":5},{"v":0,"d":"0.00"},{"$nulls":5},{"v":0,"d":"0.00"},{"$nulls":5},{"v":0,"d":"0.00"},{"$nulls":5},{"v":0,"d":"0.00"},{"$nulls":5},{"v":0,"d":"0.00"},{"$nulls":5},{"v":0,"d":"0.00"},{"$nulls":5},{"v":0,"d":"0.00"}]
[{"$f":"IF(ISBLANK(Sheet1!A47),\" \",Sheet1!A47)","v":28},{"$f":"IF(ISBLANK(Sheet1!B47),\" \",Sheet1!B47)","v":" "},{"$f":"IF(ISBLANK(Sheet1!C47),\" \",Sheet1!C47)","v":" "},{"$nulls":5},{"v":0,"d":"0.00"},{"$nulls":5},{"v":0,"d":"0.00"},{"$nulls":5},{"v":0,"d":"0.00"},{"$nulls":5},{"v":0,"d":"0.00"},{"$nulls":5},{"v":0,"d":"0.00"},{"$nulls":5},{"v":0,"d":"0.00"},{"$nulls":5},{"v":0,"d":"0.00"},{"$nulls":5},{"v":0,"d":"0.00"},{"$nulls":5},{"v":0,"d":"0.00"}]
[{"$f":"IF(ISBLANK(Sheet1!A48),\" \",Sheet1!A48)","v":29},{"$f":"IF(ISBLANK(Sheet1!B48),\" \",Sheet1!B48)","v":" "},{"$f":"IF(ISBLANK(Sheet1!C48),\" \",Sheet1!C48)","v":" "},{"$nulls":5},{"v":0,"d":"0.00"},{"$nulls":5},{"v":0,"d":"0.00"},{"$nulls":5},{"v":0,"d":"0.00"},{"$nulls":5},{"v":0,"d":"0.00"},{"$nulls":5},{"v":0,"d":"0.00"},{"$nulls":5},{"v":0,"d":"0.00"},{"$nulls":5},{"v":0,"d":"0.00"},{"$nulls":5},{"v":0,"d":"0.00"},{"$nulls":5},{"v":0,"d":"0.00"}]
[{"$f":"IF(ISBLANK(Sheet1!A49),\" \",Sheet1!A49)","v":30},{"$f":"IF(ISBLANK(Sheet1!B49),\" \",Sheet1!B49)","v":" "},{"$f":"IF(ISBLANK(Sheet1!C49),\" \",Sheet1!C49)","v":" "},{"$nulls":5},{"v":0,"d":"0.00"},{"$nulls":5},{"v":0,"d":"0.00"},{"$nulls":5},{"v":0,"d":"0.00"},{"$nulls":5},{"v":0,"d":"0.00"},{"$nulls":5},{"v":0,"d":"0.00"},{"$nulls":5},{"v":0,"d":"0.00"},{"$nulls":5},{"v":0,"d":"0.00"},{"$nulls":5},{"v":0,"d":"0.00"},{"$nulls":5},{"v":0,"d":"0.00"}]
[{"$f":"IF(ISBLANK(Sheet1!A50),\" \",Sheet1!A50)","v":31},{"$f":"IF(ISBLANK(Sheet1!B50),\" \",Sheet1!B50)","v":" "},{"$f":"IF(ISBLANK(Sheet1!C50),\" \",Sheet1!C50)","v":" "},{"$nulls":5},{"v":0,"d":"0.00"},{"$nulls":5},{"v":0,"d":"0.00"},{"$nulls":5},{"v":0,"d":"0.00"},{"$nulls":5},{"v":0,"d":"0.00"},{"$nulls":5},{"v":0,"d":"0.00"},{"$nulls":5},{"v":0,"d":"0.00"},{"$nulls":5},{"v":0,"d":"0.00"},{"$nulls":5},{"v":0,"d":"0.00"},{"$nulls":5},{"v":0,"d":"0.00"}]
[{"$f":"IF(ISBLANK(Sheet1!A51),\" \",Sheet1!A51)","v":32},{"$f":"IF(ISBLANK(Sheet1!B51),\" \",Sheet1!B51)","v":" "},{"$f":"IF(ISBLANK(Sheet1!C51),\" \",Sheet1!C51)","v":" "},{"$nulls":5},{"v":0,"d":"0.00"},{"$nulls":5},{"v":0,"d":"0.00"},{"$nulls":5},{"v":0,"d":"0.00"},{"$nulls":5},{"v":0,"d":"0.00"},{"$nulls":5},{"v":0,"d":"0.00"},{"$nulls":5},{"v":0,"d":"0.00"},{"$nulls":5},{"v":0,"d":"0.00"},{"$nulls":5},{"v":0,"d":"0.00"},{"$nulls":5},{"v":0,"d":"0.00"}]
[{"$f":"IF(ISBLANK(Sheet1!A52),\" \",Sheet1!A52)","v":33},{"$f":"IF(ISBLANK(Sheet1!B52),\" \",Sheet1!B52)","v":" "},{"$f":"IF(ISBLANK(Sheet1!C52),\" \",Sheet1!C52)","v":" "},{"$nulls":5},{"v":0,"d":"0.00"},{"$nulls":5},{"v":0,"d":"0.00"},{"$nulls":5},{"v":0,"d":"0.00"},{"$nulls":5},{"v":0,"d":"0.00"},{"$nulls":5},{"v":0,"d":"0.00"},{"$nulls":5},{"v":0,"d":"0.00"},{"$nulls":5},{"v":0,"d":"0.00"},{"$nulls":5},{"v":0,"d":"0.00"},{"$nulls":5},{"v":0,"d":"0.00"}]
[{"$f":"IF(ISBLANK(Sheet1!A53),\" \",Sheet1!A53)","v":34},{"$f":"IF(ISBLANK(Sheet1!B53),\" \",Sheet1!B53)","v":" "},{"$f":"IF(ISBLANK(Sheet1!C53),\" \",Sheet1!C53)","v":" "},{"$nulls":5},{"v":0,"d":"0.00"},{"$nulls":5},{"v":0,"d":"0.00"},{"$nulls":5},{"v":0,"d":"0.00"},{"$nulls":5},{"v":0,"d":"0.00"},{"$nulls":5},{"v":0,"d":"0.00"},{"$nulls":5},{"v":0,"d":"0.00"},{"$nulls":5},{"v":0,"d":"0.00"},{"$nulls":5},{"v":0,"d":"0.00"},{"$nulls":5},{"v":0,"d":"0.00"}]
[{"$f":"IF(ISBLANK(Sheet1!A54),\" \",Sheet1!A54)","v":35},{"$f":"IF(ISBLANK(Sheet1!B54),\" \",Sheet1!B54)","v":" "},{"$f":"IF(ISBLANK(Sheet1!C54),\" \",Sheet1!C54)","v":" "},{"$nulls":5},{"v":0,"d":"0.00"},{"$nulls":5},{"v":0,"d":"0.00"},{"$nulls":5},{"v":0,"d":"0.00"},{"$nulls":5},{"v":0,"d":"0.00"},{"$nulls":5},{"v":0,"d":"0.00"},{"$nulls":5},{"v":0,"d":"0.00"},{"$nulls":5},{"v":0,"d":"0.00"},{"$nulls":5},{"v":0,"d":"0.00"},{"$nulls":5},{"v":0,"d":"0.00"}]
[{"$f":"IF(ISBLANK(Sheet1!A55),\" \",Sheet1!A55)","v":36},{"$f":"IF(ISBLANK(Sheet1!B55),\" \",Sheet1!B55)","v":" "},{"$f":"IF(ISBLANK(Sheet1!C55),\" \",Sheet1!C55)","v":" "},{"$nulls":5},{"$f":"D44+E44+F44+G44+H44","v":{"v":0,"d":"0.00"}},{"$nulls":5},{"$f":"J44+K44+L44+M44+N44","v":{"v":0,"d":"0.00"}},{"$nulls":5},{"$f":"P44+Q44+R44+S44+T44","v":{"v":0,"d":"0.00"}},{"$nulls":5},{"$f":"V44+W44+X44+Y44+Z44","v":{"v":0,"d":"0.00"}},{"$nulls":5},{"$f":"AB44+AC44+AD44+AE44+AF44","v":{"v":0,"d":"0.00"}},{"$nulls":5},{"$f":"AH44+AI44+AJ44+AK44+AL44","v":{"v":0,"d":"0.00"}},{"$nulls":5},{"$f":"AN44+AO44+AP44+AQ44+AR44","v":{"v":0,"d":"0.00"}},{"$nulls":5},{"$f":"AT44+AU44+AV44+AW44+AX44","v":{"v":0,"d":"0.00"}},{"$nulls":5},{"$f":"AZ44+BA44+BB44+BC44+BD44","v":{"v":0,"d":"0.00"}}]
[{"$f":"IF(ISBLANK(Sheet1!A56),\" \",Sheet1!A56)","v":37},{"$f":"IF(ISBLANK(Sheet1!B56),\" \",Sheet1!B56)","v":" "},{"$f":"IF(ISBLANK(Sheet1!C56),\" \",Sheet1!C56)","v":" "},{"$nulls":5},{"$f":"D45+E45+F45+G45+H45","v":{"v":0,"d":"0.00"}},{"$nulls":5},{"$f":"J45+K45+L45+M45+N45","v":{"v":0,"d":"0.00"}},{"$nulls":5},{"$f":"P45+Q45+R45+S45+T45","v":{"v":0,"d":"0.00"}},{"$nulls":5},{"$f":"V45+W45+X45+Y45+Z45","v":{"v":0,"d":"0.00"}},{"$nulls":5},{"$f":"AB45+AC45+AD45+AE45+AF45","v":{"v":0,"d":"0.00"}},{"$nulls":5},{"$f":"AH45+AI45+AJ45+AK45+AL45","v":{"v":0,"d":"0.00"}},{"$nulls":5},{"$f":"AN45+AO45+AP45+AQ45+AR45","v":{"v":0,"d":"0.00"}},{"$nulls":5},{"$f":"AT45+AU45+AV45+AW45+AX45","v":{"v":0,"d":"0.00"}},{"$nulls":5},{"$f":"AZ45+BA45+BB45+BC45+BD45","v":{"v":0,"d":"0.00"}}]
[{"$f":"IF(ISBLANK(Sheet1!A57),\" \",Sheet1!A57)","v":38},{"$f":"IF(ISBLANK(Sheet1!B57),\" \",Sheet1!B57)","v":" "},{"$f":"IF(ISBLANK(Sheet1!C57),\" \",Sheet1!C57)","v":" "},{"$nulls":5},{"v":0,"d":"0.00"},{"$nulls":5},{"v":0,"d":"0.00"},{"$nulls":5},{"v":0,"d":"0.00"},{"$nulls":5},{"v":0,"d":"0.00"},{"$nulls":5},{"v":0,"d":"0.00"},{"$nulls":5},{"v":0,"d":"0.00"},{"$nulls":5},{"v":0,"d":"0.00"},{"$nulls":5},{"v":0,"d":"0.00"},{"$nulls":5},{"v":0,"d":"0.00"}]
[{"$f":"IF(ISBLANK(Sheet1!A58),\" \",Sheet1!A58)","v":39},{"$f":"IF(ISBLANK(Sheet1!B58),\" \",Sheet1!B58)","v":" "},{"$f":"IF(ISBLANK(Sheet1!C58),\" \",Sheet1!C58)","v":" "},{"$nulls":5},{"v":0,"d":"0.00"},{"$nulls":5},{"v":0,"d":"0.00"},{"$nulls":5},{"v":0,"d":"0.00"},{"$nulls":5},{"v":0,"d":"0.00"},{"$nulls":5},{"v":0,"d":"0.00"},{"$nulls":5},{"v":0,"d":"0.00"},{"$nulls":5},{"v":0,"d":"0.00"},{"$nulls":5},{"v":0,"d":"0.00"},{"$nulls":5},{"v":0,"d":"0.00"}]
[{"$f":"IF(ISBLANK(Sheet1!A59),\" \",Sheet1!A59)","v":40},{"$f":"IF(ISBLANK(Sheet1!B59),\" \",Sheet1!B59)","v":" "},{"$f":"IF(ISBLANK(Sheet1!C59),\" \",Sheet1!C59)","v":" "},{"$nulls":5},{"v":0,"d":"0.00"},{"$nulls":5},{"v":0,"d":"0.00"},{"$nulls":5},{"v":0,"d":"0.00"},{"$nulls":5},{"v":0,"d":"0.00"},{"$nulls":5},{"v":0,"d":"0.00"},{"$nulls":5},{"v":0,"d":"0.00"},{"$nulls":5},{"v":0,"d":"0.00"},{"$nulls":5},{"v":0,"d":"0.00"},{"$nulls":5},{"v":0,"d":"0.00"}]
[{"$f":"IF(ISBLANK(Sheet1!A60),\" \",Sheet1!A60)","v":41},{"$f":"IF(ISBLANK(Sheet1!B60),\" \",Sheet1!B60)","v":" "},{"$f":"IF(ISBLANK(Sheet1!C60),\" \",Sheet1!C60)","v":" "},{"$nulls":5},{"v":0,"d":"0.00"},{"$nulls":5},{"v":0,"d":"0.00"},{"$nulls":5},{"v":0,"d":"0.00"},{"$nulls":5},{"v":0,"d":"0.00"},{"$nulls":5},{"v":0,"d":"0.00"},{"$nulls":5},{"v":0,"d":"0.00"},{"$nulls":5},{"v":0,"d":"0.00"},{"$nulls":5},{"v":0,"d":"0.00"},{"$nulls":5},{"v":0,"d":"0.00"}]
[{"$f":"IF(ISBLANK(Sheet1!A61),\" \",Sheet1!A61)","v":42},{"$f":"IF(ISBLANK(Sheet1!B61),\" \",Sheet1!B61)","v":" "},{"$f":"IF(ISBLANK(Sheet1!C61),\" \",Sheet1!C61)","v":" "},{"$nulls":5},{"v":0,"d":"0.00"},{"$nulls":5},{"v":0,"d":"0.00"},{"$nulls":5},{"v":0,"d":"0.00"},{"$nulls":5},{"v":0,"d":"0.00"},{"$nulls":5},{"v":0,"d":"0.00"},{"$nulls":5},{"v":0,"d":"0.00"},{"$nulls":5},{"v":0,"d":"0.00"},{"$nulls":5},{"v":0,"d":"0.00"},{"$nulls":5},{"v":0,"d":"0.00"}]
[{"$f":"IF(ISBLANK(Sheet1!A62),\" \",Sheet1!A62)","v":43},{"$f":"IF(ISBLANK(Sheet1!B62),\" \",Sheet1!B62)","v":" "},{"$f":"IF(ISBLANK(Sheet1!C62),\" \",Sheet1!C62)","v":" "},{"$nulls":5},{"v":0,"d":"0.00"},{"$nulls":5},{"v":0,"d":"0.00"},{"$nulls":5},{"v":0,"d":"0.00"},{"$nulls":5},{"v":0,"d":"0.00"},{"$nulls":5},{"v":0,"d":"0.00"},{"$nulls":5},{"v":0,"d":"0.00"},{"$nulls":5},{"v":0,"d":"0.00"},{"$nulls":5},{"v":0,"d":"0.00"},{"$nulls":5},{"v":0,"d":"0.00"}]
[{"$f":"IF(ISBLANK(Sheet1!A63),\" \",Sheet1!A63)","v":44},{"$f":"IF(ISBLANK(Sheet1!B63),\" \",Sheet1!B63)","v":" "},{"$f":"IF(ISBLANK(Sheet1!C63),\" \",Sheet1!C63)","v":" "},{"$nulls":5},{"v":0,"d":"0.00"},{"$nulls":5},{"v":0,"d":"0.00"},{"$nulls":5},{"v":0,"d":"0.00"},{"$nulls":5},{"v":0,"d":"0.00"},{"$nulls":5},{"v":0,"d":"0.00"},{"$nulls":5},{"v":0,"d":"0.00"},{"$nulls":5},{"v":0,"d":"0.00"},{"$nulls":5},{"v":0,"d":"0.00"},{"$nulls":5},{"v":0,"d":"0.00"}]
[{"$f":"IF(ISBLANK(Sheet1!A64),\" \",Sheet1!A64)","v":45},{"$f":"IF(ISBLANK(Sheet1!B64),\" \",Sheet1!B64)","v":" "},{"$f":"IF(ISBLANK(Sheet1!C64),\" \",Sheet1!C64)","v":" "},{"$nulls":5},{"v":0,"d":"0.00"},{"$nulls":5},{"v":0,"d":"0.00"},{"$nulls":5},{"v":0,"d":"0.00"},{"$nulls":5},{"v":0,"d":"0.00"},{"$nulls":5},{"v":0,"d":"0.00"},{"$nulls":5},{"v":0,"d":"0.00"},{"$nulls":5},{"v":0,"d":"0.00"},{"$nulls":5},{"v":0,"d":"0.00"},{"$nulls":5},{"v":0,"d":"0.00"}]
[{"$f":"IF(ISBLANK(Sheet1!A65),\" \",Sheet1!A65)","v":46},{"$f":"IF(ISBLANK(Sheet1!B65),\" \",Sheet1!B65)","v":" "},{"$f":"IF(ISBLANK(Sheet1!C65),\" \",Sheet1!C65)","v":" "},{"$nulls":5},{"v":0,"d":"0.00"},{"$nulls":5},{"v":0,"d":"0.00"},{"$nulls":5},{"v":0,"d":"0.00"},{"$nulls":5},{"v":0,"d":"0.00"},{"$nulls":5},{"v":0,"d":"0.00"},{"$nulls":5},{"v":0,"d":"0.00"},{"$nulls":5},{"v":0,"d":"0.00"},{"$nulls":5},{"v":0,"d":"0.00"},{"$nulls":5},{"v":0,"d":"0.00"}]
[{"$f":"IF(ISBLANK(Sheet1!A66),\" \",Sheet1!A66)","v":47},{"$f":"IF(ISBLANK(Sheet1!B66),\" \",Sheet1!B66)","v":" "},{"$f":"IF(ISBLANK(Sheet1!C66),\" \",Sheet1!C66)","v":" "},{"$nulls":5},{"v":0,"d":"0.00"},{"$nulls":5},{"v":0,"d":"0.00"},{"$nulls":5},{"v":0,"d":"0.00"},{"$nulls":5},{"v":0,"d":"0.00"},{"$nulls":5},{"v":0,"d":"0.00"},{"$nulls":5},{"v":0,"d":"0.00"},{"$nulls":5},{"v":0,"d":"0.00"},{"$nulls":5},{"v":0,"d":"0.00"},{"$nulls":5},{"v":0,"d":"0.00"}]
[{"$f":"IF(ISBLANK(Sheet1!A67),\" \",Sheet1!A67)","v":48},{"$f":"IF(ISBLANK(Sheet1!B67),\" \",Sheet1!B67)","v":" "},{"$f":"IF(ISBLANK(Sheet1!C67),\" \",Sheet1!C67)","v":" "},{"$nulls":5},{"$f":"D56+E56+F56+G56+H56","v":{"v":0,"d":"0.00"}},{"$nulls":5},{"$f":"J56+K56+L56+M56+N56","v":{"v":0,"d":"0.00"}},{"$nulls":5},{"$f":"P56+Q56+R56+S56+T56","v":{"v":0,"d":"0.00"}},{"$nulls":5},{"$f":"V56+W56+X56+Y56+Z56","v":{"v":0,"d":"0.00"}},{"$nulls":5},{"$f":"AB56+AC56+AD56+AE56+AF56","v":{"v":0,"d":"0.00"}},{"$nulls":5},{"$f":"AH56+AI56+AJ56+AK56+AL56","v":{"v":0,"d":"0.00"}},{"$nulls":5},{"$f":"AN56+AO56+AP56+AQ56+AR56","v":{"v":0,"d":"0.00"}},{"$nulls":5},{"$f":"AT56+AU56+AV56+AW56+AX56","v":{"v":0,"d":"0.00"}},{"$nulls":5},{"$f":"AZ56+BA56+BB56+BC56+BD56","v":{"v":0,"d":"0.00"}}]
[{"$f":"IF(ISBLANK(Sheet1!A68),\" \",Sheet1!A68)","v":49},{"$f":"IF(ISBLANK(Sheet1!B68),\" \",Sheet1!B68)","v":" "},{"$f":"IF(ISBLANK(Sheet1!C68),\" \",Sheet1!C68)","v":" "},{"$nulls":5},{"v":0,"d":"0.00"},{"$nulls":5},{"v":0,"d":"0.00"},{"$nulls":5},{"v":0,"d":"0.00"},{"$nulls":5},{"v":0,"d":"0.00"},{"$nulls":5},{"v":0,"d":"0.00"},{"$nulls":5},{"v":0,"d":"0.00"},{"$nulls":5},{"v":0,"d":"0.00"},{"$nulls":5},{"v":0,"d":"0.00"},{"$nulls":5},{"v":0,"d":"0.00"}]
[{"$f":"IF(ISBLANK(Sheet1!A69),\" \",Sheet1!A69)","v":50},{"$f":"IF(ISBLANK(Sheet1!B69),\" \",Sheet1!B69)","v":" "},{"$f":"IF(ISBLANK(Sheet1!C69),\" \",Sheet1!C69)","v":" "},{"$nulls":5},{"v":0,"d":"0.00"},{"$nulls":5},{"v":0,"d":"0.00"},{"$nulls":5},{"v":0,"d":"0.00"},{"$nulls":5},{"v":0,"d":"0.00"},{"$nulls":5},{"v":0,"d":"0.00"},{"$nulls":5},{"v":0,"d":"0.00"},{"$nulls":5},{"v":0,"d":"0.00"},{"$nulls":5},{"v":0,"d":"0.00"},{"$nulls":5},{"v":0,"d":"0.00"}]
[{"$f":"IF(ISBLANK(Sheet1!A70),\" \",Sheet1!A70)","v":51},{"$f":"IF(ISBLANK(Sheet1!B70),\" \",Sheet1!B70)","v":" "},{"$f":"IF(ISBLANK(Sheet1!C70),\" \",Sheet1!C70)","v":" "},{"$nulls":5},{"v":0,"d":"0.00"},{"$nulls":5},{"v":0,"d":"0.00"},{"$nulls":5},{"v":0,"d":"0.00"},{"$nulls":5},{"v":0,"d":"0.00"},{"$nulls":5},{"v":0,"d":"0.00"},{"$nulls":5},{"v":0,"d":"0.00"},{"$nulls":5},{"v":0,"d":"0.00"},{"$nulls":5},{"v":0,"d":"0.00"},{"$nulls":5},{"v":0,"d":"0.00"}]
[{"$f":"IF(ISBLANK(Sheet1!A71),\" \",Sheet1!A71)","v":52},{"$f":"IF(ISBLANK(Sheet1!B71),\" \",Sheet1!B71)","v":" "},{"$f":"IF(ISBLANK(Sheet1!C71),\" \",Sheet1!C71)","v":" "},{"$nulls":5},{"v":0,"d":"0.00"},{"$nulls":5},{"v":0,"d":"0.00"},{"$nulls":5},{"v":0,"d":"0.00"},{"$nulls":5},{"v":0,"d":"0.00"},{"$nulls":5},{"v":0,"d":"0.00"},{"$nulls":5},{"v":0,"d":"0.00"},{"$nulls":5},{"v":0,"d":"0.00"},{"$nulls":5},{"v":0,"d":"0.00"},{"$nulls":5},{"v":0,"d":"0.00"}]
[{"$f":"IF(ISBLANK(Sheet1!A72),\" \",Sheet1!A72)","v":53},{"$f":"IF(ISBLANK(Sheet1!B72),\" \",Sheet1!B72)","v":" "},{"$f":"IF(ISBLANK(Sheet1!C72),\" \",Sheet1!C72)","v":" "},{"$nulls":5},{"v":0,"d":"0.00"},{"$nulls":5},{"v":0,"d":"0.00"},{"$nulls":5},{"v":0,"d":"0.00"},{"$nulls":5},{"v":0,"d":"0.00"},{"$nulls":5},{"v":0,"d":"0.00"},{"$nulls":5},{"v":0,"d":"0.00"},{"$nulls":5},{"v":0,"d":"0.00"},{"$nulls":5},{"v":0,"d":"0.00"},{"$nulls":5},{"v":0,"d":"0.00"}]
[{"$f":"IF(ISBLANK(Sheet1!A73),\" \",Sheet1!A73)","v":54},{"$f":"IF(ISBLANK(Sheet1!B73),\" \",Sheet1!B73)","v":" "},{"$f":"IF(ISBLANK(Sheet1!C73),\" \",Sheet1!C73)","v":" "},{"$nulls":5},{"v":0,"d":"0.00"},{"$nulls":5},{"v":0,"d":"0.00"},{"$nulls":5},{"v":0,"d":"0.00"},{"$nulls":5},{"v":0,"d":"0.00"},{"$nulls":5},{"v":0,"d":"0.00"},{"$nulls":5},{"v":0,"d":"0.00"},{"$nulls":5},{"v":0,"d":"0.00"},{"$nulls":5},{"v":0,"d":"0.00"},{"$nulls":5},{"v":0,"d":"0.00"}]
[{"$f":"IF(ISBLANK(Sheet1!A74),\" \",Sheet1!A74)","v":55},{"$f":"IF(ISBLANK(Sheet1!B74),\" \",Sheet1!B74)","v":" "},{"$f":"IF(ISBLANK(Sheet1!C74),\" \",Sheet1!C74)","v":" "},{"$nulls":5},{"v":0,"d":"0.00"},{"$nulls":5},{"v":0,"d":"0.00"},{"$nulls":5},{"v":0,"d":"0.00"},{"$nulls":5},{"v":0,"d":"0.00"},{"$nulls":5},{"v":0,"d":"0.00"},{"$nulls":5},{"v":0,"d":"0.00"},{"$nulls":5},{"v":0,"d":"0.00"},{"$nulls":5},{"v":0,"d":"0.00"},{"$nulls":5},{"v":0,"d":"0.00"}]
[{"$f":"IF(ISBLANK(Sheet1!A75),\" \",Sheet1!A75)","v":56},{"$f":"IF(ISBLANK(Sheet1!B75),\" \",Sheet1!B75)","v":" "},{"$f":"IF(ISBLANK(Sheet1!C75),\" \",Sheet1!C75)","v":" "},{"$nulls":5},{"v":0,"d":"0.00"},{"$nulls":5},{"v":0,"d":"0.00"},{"$nulls":5},{"v":0,"d":"0.00"},{"$nulls":5},{"v":0,"d":"0.00"},{"$nulls":5},{"v":0,"d":"0.00"},{"$nulls":5},{"v":0,"d":"0.00"},{"$nulls":5},{"v":0,"d":"0.00"},{"$nulls":5},{"v":0,"d":"0.00"},{"$nulls":5},{"v":0,"d":"0.00"}]
[{"$f":"IF(ISBLANK(Sheet1!A76),\" \",Sheet1!A76)","v":57},{"$f":"IF(ISBLANK(Sheet1!B76),\" \",Sheet1!B76)","v":" "},{"$f":"IF(ISBLANK(Sheet1!C76),\" \",Sheet1!C76)","v":" "},{"$nulls":5},{"v":0,"d":"0.00"},{"$nulls":5},{"v":0,"d":"0.00"},{"$nulls":5},{"v":0,"d":"0.00"},{"$nulls":5},{"v":0,"d":"0.00"},{"$nulls":5},{"v":0,"d":"0.00"},{"$nulls":5},{"v":0,"d":"0.00"},{"$nulls":5},{"v":0,"d":"0.00"},{"$nulls":5},{"v":0,"d":"0.00"},{"$nulls":5},{"v":0,"d":"0.00"}]
[{"$f":"IF(ISBLANK(Sheet1!A77),\" \",Sheet1!A77)","v":58},{"$f":"IF(ISBLANK(Sheet1!B77),\" \",Sheet1!B77)","v":" "},{"$f":"IF(ISBLANK(Sheet1!C77),\" \",Sheet1!C77)","v":" "},{"$nulls":5},{"v":0,"d":"0.00"},{"$nulls":5},{"v":0,"d":"0.00"},{"$nulls":5},{"v":0,"d":"0.00"},{"$nulls":5},{"v":0,"d":"0.00"},{"$nulls":5},{"v":0,"d":"0.00"},{"$nulls":5},{"v":0,"d":"0.00"},{"$nulls":5},{"v":0,"d":"0.00"},{"$nulls":5},{"v":0,"d":"0.00"},{"$nulls":5},{"v":0,"d":"0.00"}]
[{"$f":"IF(ISBLANK(Sheet1!A78),\" \",Sheet1!A78)","v":59},{"$f":"IF(ISBLANK(Sheet1!B78),\" \",Sheet1!B78)","v":" "},{"$f":"IF(ISBLANK(Sheet1!C78),\" \",Sheet1!C78)","v":" "},{"$nulls":5},{"$f":"D67+E67+F67+G67+H67","v":{"v":0,"d":"0.00"}},{"$nulls":5},{"$f":"J67+K67+L67+M67+N67","v":{"v":0,"d":"0.00"}},{"$nulls":5},{"$f":"P67+Q67+R67+S67+T67","v":{"v":0,"d":"0.00"}},{"$nulls":5},{"$f":"V67+W67+X67+Y67+Z67","v":{"v":0,"d":"0.00"}},{"$nulls":5},{"$f":"AB67+AC67+AD67+AE67+AF67","v":{"v":0,"d":"0.00"}},{"$nulls":5},{"$f":"AH67+AI67+AJ67+AK67+AL67","v":{"v":0,"d":"0.00"}},{"$nulls":5},{"$f":"AN67+AO67+AP67+AQ67+AR67","v":{"v":0,"d":"0.00"}},{"$nulls":5},{"$f":"AT67+AU67+AV67+AW67+AX67","v":{"v":0,"d":"0.00"}},{"$nulls":5},{"$f":"AZ67+BA67+BB67+BC67+BD67","v":{"v":0,"d":"0.00"}}]
[{"$f":"IF(ISBLANK(Sheet1!A79),\" \",Sheet1!A79)","v":60},{"$f":"IF(ISBLANK(Sheet1!B79),\" \",Sheet1!B79)","v":" "},{"$f":"IF(ISBLANK(Sheet1!C79),\" \",Sheet1!C79)","v":" "},{"$nulls":5},{"v":0,"d":"0.00"},{"$nulls":5},{"v":0,"d":"0.00"},{"$nulls":5},{"v":0,"d":"0.00"},{"$nulls":5},{"v":0,"d":"0.00"},{"$nulls":5},{"v":0,"d":"0.00"},{"$nulls":5},{"v":0,"d":"0.00"},{"$nulls":5},{"v":0,"d":"0.00"},{"$nulls":5},{"v":0,"d":"0.00"},{"$nulls":5},{"v":0,"d":"0.00"}]
[]
["Certified that,"]
["(1) The entries are verified with the records and there is no error or omission."]
["(2) These assessments were published and no grievances are pending."]

{"sheet":"CCA_Form_A_Part_II","index":2,"n_rows":79,"n_cols":13,"rows_kept":79,"merged":[[0,0,0,12],[1,0,1,12],[2,1,2,2],[3,1,3,2],[3,4,3,5],[4,0,4,1],[4,7,4,8],[5,0,5,1],[6,0,6,2],[6,12,7,12],[7,0,7,2],[8,0,8,2],[72,0,72,3],[73,0,73,3],[74,0,74,3],[78,0,78,2],[78,3,78,4],[78,7,78,12]]}
["ST. JOSEPH'S COLLEGE, MOOLAMATTOM (AUTONOMOUS)"]
["CCA Form A: Part II"]
["Course Code:",{"$f":"Sheet1!D3","v":"MG1DSCMA101"}]
["Semester:",{"$f":"Sheet1!D4","v":1},{"$nulls":8},3]
["Number of Course Outcomes:",null,{"$f":"Sheet1!D7","v":9}]
["CCA Component Type (Theory/Practical):",null,{"$f":"Sheet1!D5","v":"THEORY"}]
["CO Number",null,null,"CO 1","CO 2","CO 3","CO 4","CO 5","CO 6","CO 7","CO 8","CO 9","Total Marks Allocated for CCA"]
["Evaluation Method(s) Used",null,null,{"$f":"Sheet1!A11&CHAR(10)&Sheet1!A12&CHAR(10)&Sheet1!A13&CHAR(10)&Sheet1!A14&CHAR(10)&Sheet1!A15","v":"\n\n\n\n"},{"$f":"Sheet1!D11&CHAR(10)&Sheet1!D12&CHAR(10)&Sheet1!D13&CHAR(10)&Sheet1!D14&CHAR(10)&Sheet1!D15","v":"\n\n\n\n"},{"$f":"Sheet1!G11&CHAR(10)&Sheet1!G12&CHAR(10)&Sheet1!G13&CHAR(10)&Sheet1!G14&CHAR(10)&Sheet1!G15","v":"\n\n\n\n"},{"$f":"Sheet1!J11&CHAR(10)&Sheet1!J12&CHAR(10)&Sheet1!J13&CHAR(10)&Sheet1!J14&CHAR(10)&Sheet1!J15","v":"\n\n\n\n"},{"$f":"Sheet1!M11&CHAR(10)&Sheet1!M12&CHAR(10)&Sheet1!M13&CHAR(10)&Sheet1!M14&CHAR(10)&Sheet1!M15","v":"\n\n\n\n"},{"$f":"Sheet1!P11&CHAR(10)&Sheet1!P12&CHAR(10)&Sheet1!P13&CHAR(10)&Sheet1!P14&CHAR(10)&Sheet1!P15","v":"\n\n\n\n"},{"$f":"Sheet1!S11&CHAR(10)&Sheet1!S12&CHAR(10)&Sheet1!S13&CHAR(10)&Sheet1!S14&CHAR(10)&Sheet1!S15","v":"\n\n\n\n"},{"$f":"Sheet1!V11&CHAR(10)&Sheet1!V12&CHAR(10)&Sheet1!V13&CHAR(10)&Sheet1!V14&CHAR(10)&Sheet1!V15","v":"\n\n\n\n"},{"$f":"Sheet1!Y11&CHAR(10)&Sheet1!Y12&CHAR(10)&Sheet1!Y13&CHAR(10)&Sheet1!Y14&CHAR(10)&Sheet1!Y15","v":"\n\n\n\n"}]
["Maximum Marks Allocated",null,null,{"$f":"Sheet1!C16","v":0},{"$f":"Sheet1!F16","v":0},{"$f":"Sheet1!I16","v":0},{"$f":"Sheet1!L16","v":0},{"$f":"Sheet1!O16","v":0},{"$f":"Sheet1!R16","v":0},{"$f":"Sheet1!U16","v":0},{"$f":"Sheet1!X16","v":0},{"$f":"Sheet1!AA16","v":0},{"$f":"Sheet1!D8","v":0}]
["SL. No.","Register Number","Name of the Student","Marks Obtained in CO 1","Marks Obtained in CO 2","Marks Obtained in CO 3","Marks Obtained in CO 4","Marks Obtained in CO 5","Marks Obtained in CO 6","Marks Obtained in CO 7","Marks Obtained in CO 8","Marks Obtained in CO 9","Total Marks Obtained in CCA"]
[{"$f":"IF(ISBLANK(Sheet1!A20),\" \",Sheet1!A20)","v":1},{"$f":"IF(ISBLANK(Sheet1!B20),\" \",Sheet1!B20)","v":" "},{"$f":"IF(ISBLANK(Sheet1!C20),\" \",Sheet1!C20)","v":" "},{"$f":"IF(CCA_Form_A_Part_I!I9=0,\"NA\",CCA_Form_A_Part_I!I9)","v":"NA"},{"$f":"IF(CCA_Form_A_Part_I!O9=0,\"NA\",CCA_Form_A_Part_I!O9)","v":"NA"},{"$f":"IF(CCA_Form_A_Part_I!U9=0,\"NA\",CCA_Form_A_Part_I!U9)","v":"NA"},{"$f":"IF(CCA_Form_A_Part_I!AA9=0,\"NA\",CCA_Form_A_Part_I!AA9)","v":"NA"},{"$f":"IF(CCA_Form_A_Part_I!AG9=0,\"NA\",CCA_Form_A_Part_I!AG9)","v":"NA"},{"$f":"IF(CCA_Form_A_Part_I!AM9=0,\"NA\",CCA_Form_A_Part_I!AM9)","v":"NA"},{"$f":"IF(CCA_Form_A_Part_I!AS9=0,\"NA\",CCA_Form_A_Part_I!AS9)","v":"NA"},{"$f":"IF(CCA_Form_A_Part_I!AY9=0,\"NA\",CCA_Form_A_Part_I!AY9)","v":"NA"},{"$f":"IF(CCA_Form_A_Part_I!BE9=0,\"NA\",CCA_Form_A_Part_I!BE9)","v":"NA"},{"$f":"SUM(D11:L11)","v":0}]
[{"$f":"IF(ISBLANK(Sheet1!A21),\" \",Sheet1!A21)","v":2},{"$f":"IF(ISBLANK(Sheet1!B21),\" \",Sheet1!B21)","v":" "},{"$f":"IF(ISBLANK(Sheet1!C21),\" \",Sheet1!C21)","v":" "},{"$f":"IF(CCA_Form_A_Part_I!I10=0,\"NA\",CCA_Form_A_Part_I!I10)","v":"NA"},{"$f":"IF(CCA_Form_A_Part_I!O10=0,\"NA\",CCA_Form_A_Part_I!O10)","v":"NA"},{"$f":"IF(CCA_Form_A_Part_I!U10=0,\"NA\",CCA_Form_A_Part_I!U10)","v":"NA"},{"$f":"IF(CCA_Form_A_Part_I!AA10=0,\"NA\",CCA_Form_A_Part_I!AA10)","v":"NA"},{"$f":"IF(CCA_Form_A_Part_I!AG10=0,\"NA\",CCA_Form_A_Part_I!AG10)","v":"NA"},{"$f":"IF(CCA_Form_A_Part_I!AM10=0,\"NA\",CCA_Form_A_Part_I!AM10)","v":"NA"},{"$f":"IF(CCA_Form_A_Part_I!AS10=0,\"NA\",CCA_Form_A_Part_I!AS10)","v":"NA"},{"$f":"IF(CCA_Form_A_Part_I!AY10=0,\"NA\",CCA_Form_A_Part_I!AY10)","v":"NA"},{"$f":"IF(CCA_Form_A_Part_I!BE10=0,\"NA\",CCA_Form_A_Part_I!BE10)","v":"NA"},{"$f":"SUM(D12:L12)","v":0}]
[{"$f":"IF(ISBLANK(Sheet1!A22),\" \",Sheet1!A22)","v":3},{"$f":"IF(ISBLANK(Sheet1!B22),\" \",Sheet1!B22)","v":" "},{"$f":"IF(ISBLANK(Sheet1!C22),\" \",Sheet1!C22)","v":" "},{"$f":"IF(CCA_Form_A_Part_I!I11=0,\"NA\",CCA_Form_A_Part_I!I11)","v":"NA"},{"$f":"IF(CCA_Form_A_Part_I!O11=0,\"NA\",CCA_Form_A_Part_I!O11)","v":"NA"},{"$f":"IF(CCA_Form_A_Part_I!U11=0,\"NA\",CCA_Form_A_Part_I!U11)","v":"NA"},{"$f":"IF(CCA_Form_A_Part_I!AA11=0,\"NA\",CCA_Form_A_Part_I!AA11)","v":"NA"},{"$f":"IF(CCA_Form_A_Part_I!AG11=0,\"NA\",CCA_Form_A_Part_I!AG11)","v":"NA"},{"$f":"IF(CCA_Form_A_Part_I!AM11=0,\"NA\",CCA_Form_A_Part_I!AM11)","v":"NA"},{"$f":"IF(CCA_Form_A_Part_I!AS11=0,\"NA\",CCA_Form_A_Part_I!AS11)","v":"NA"},{"$f":"IF(CCA_Form_A_Part_I!AY11=0,\"NA\",CCA_Form_A_Part_I!AY11)","v":"NA"},{"$f":"IF(CCA_Form_A_Part_I!BE11=0,\"NA\",CCA_Form_A_Part_I!BE11)","v":"NA"},0]
[{"$f":"IF(ISBLANK(Sheet1!A23),\" \",Sheet1!A23)","v":4},{"$f":"IF(ISBLANK(Sheet1!B23),\" \",Sheet1!B23)","v":" "},{"$f":"IF(ISBLANK(Sheet1!C23),\" \",Sheet1!C23)","v":" "},{"$f":"IF(CCA_Form_A_Part_I!I12=0,\"NA\",CCA_Form_A_Part_I!I12)","v":"NA"},{"$f":"IF(CCA_Form_A_Part_I!O12=0,\"NA\",CCA_Form_A_Part_I!O12)","v":"NA"},{"$f":"IF(CCA_Form_A_Part_I!U12=0,\"NA\",CCA_Form_A_Part_I!U12)","v":"NA"},{"$f":"IF(CCA_Form_A_Part_I!AA12=0,\"NA\",CCA_Form_A_Part_I!AA12)","v":"NA"},{"$f":"IF(CCA_Form_A_Part_I!AG12=0,\"NA\",CCA_Form_A_Part_I!AG12)","v":"NA"},{"$f":"IF(CCA_Form_A_Part_I!AM12=0,\"NA\",CCA_Form_A_Part_I!AM12)","v":"NA"},{"$f":"IF(CCA_Form_A_Part_I!AS12=0,\"NA\",CCA_Form_A_Part_I!AS12)","v":"NA"},{"$f":"IF(CCA_Form_A_Part_I!AY12=0,\"NA\",CCA_Form_A_Part_I!AY12)","v":"NA"},{"$f":"IF(CCA_Form_A_Part_I!BE12=0,\"NA\",CCA_Form_A_Part_I!BE12)","v":"NA"},0]
[{"$f":"IF(ISBLANK(Sheet1!A24),\" \",Sheet1!A24)","v":5},{"$f":"IF(ISBLANK(Sheet1!B24),\" \",Sheet1!B24)","v":" "},{"$f":"IF(ISBLANK(Sheet1!C24),\" \",Sheet1!C24)","v":" "},{"$f":"IF(CCA_Form_A_Part_I!I13=0,\"NA\",CCA_Form_A_Part_I!I13)","v":"NA"},{"$f":"IF(CCA_Form_A_Part_I!O13=0,\"NA\",CCA_Form_A_Part_I!O13)","v":"NA"},{"$f":"IF(CCA_Form_A_Part_I!U13=0,\"NA\",CCA_Form_A_Part_I!U13)","v":"NA"},{"$f":"IF(CCA_Form_A_Part_I!AA13=0,\"NA\",CCA_Form_A_Part_I!AA13)","v":"NA"},{"$f":"IF(CCA_Form_A_Part_I!AG13=0,\"NA\",CCA_Form_A_Part_I!AG13)","v":"NA"},{"$f":"IF(CCA_Form_A_Part_I!AM13=0,\"NA\",CCA_Form_A_Part_I!AM13)","v":"NA"},{"$f":"IF(CCA_Form_A_Part_I!AS13=0,\"NA\",CCA_Form_A_Part_I!AS13)","v":"NA"},{"$f":"IF(CCA_Form_A_Part_I!AY13=0,\"NA\",CCA_Form_A_Part_I!AY13)","v":"NA"},{"$f":"IF(CCA_Form_A_Part_I!BE13=0,\"NA\",CCA_Form_A_Part_I!BE13)","v":"NA"},0]
[{"$f":"IF(ISBLANK(Sheet1!A25),\" \",Sheet1!A25)","v":6},{"$f":"IF(ISBLANK(Sheet1!B25),\" \",Sheet1!B25)","v":" "},{"$f":"IF(ISBLANK(Sheet1!C25),\" \",Sheet1!C25)","v":" "},{"$f":"IF(CCA_Form_A_Part_I!I14=0,\"NA\",CCA_Form_A_Part_I!I14)","v":"NA"},{"$f":"IF(CCA_Form_A_Part_I!O14=0,\"NA\",CCA_Form_A_Part_I!O14)","v":"NA"},{"$f":"IF(CCA_Form_A_Part_I!U14=0,\"NA\",CCA_Form_A_Part_I!U14)","v":"NA"},{"$f":"IF(CCA_Form_A_Part_I!AA14=0,\"NA\",CCA_Form_A_Part_I!AA14)","v":"NA"},{"$f":"IF(CCA_Form_A_Part_I!AG14=0,\"NA\",CCA_Form_A_Part_I!AG14)","v":"NA"},{"$f":"IF(CCA_Form_A_Part_I!AM14=0,\"NA\",CCA_Form_A_Part_I!AM14)","v":"NA"},{"$f":"IF(CCA_Form_A_Part_I!AS14=0,\"NA\",CCA_Form_A_Part_I!AS14)","v":"NA"},{"$f":"IF(CCA_Form_A_Part_I!AY14=0,\"NA\",CCA_Form_A_Part_I!AY14)","v":"NA"},{"$f":"IF(CCA_Form_A_Part_I!BE14=0,\"NA\",CCA_Form_A_Part_I!BE14)","v":"NA"},0]
[{"$f":"IF(ISBLANK(Sheet1!A26),\" \",Sheet1!A26)","v":7},{"$f":"IF(ISBLANK(Sheet1!B26),\" \",Sheet1!B26)","v":" "},{"$f":"IF(ISBLANK(Sheet1!C26),\" \",Sheet1!C26)","v":" "},{"$f":"IF(CCA_Form_A_Part_I!I15=0,\"NA\",CCA_Form_A_Part_I!I15)","v":"NA"},{"$f":"IF(CCA_Form_A_Part_I!O15=0,\"NA\",CCA_Form_A_Part_I!O15)","v":"NA"},{"$f":"IF(CCA_Form_A_Part_I!U15=0,\"NA\",CCA_Form_A_Part_I!U15)","v":"NA"},{"$f":"IF(CCA_Form_A_Part_I!AA15=0,\"NA\",CCA_Form_A_Part_I!AA15)","v":"NA"},{"$f":"IF(CCA_Form_A_Part_I!AG15=0,\"NA\",CCA_Form_A_Part_I!AG15)","v":"NA"},{"$f":"IF(CCA_Form_A_Part_I!AM15=0,\"NA\",CCA_Form_A_Part_I!AM15)","v":"NA"},{"$f":"IF(CCA_Form_A_Part_I!AS15=0,\"NA\",CCA_Form_A_Part_I!AS15)","v":"NA"},{"$f":"IF(CCA_Form_A_Part_I!AY15=0,\"NA\",CCA_Form_A_Part_I!AY15)","v":"NA"},{"$f":"IF(CCA_Form_A_Part_I!BE15=0,\"NA\",CCA_Form_A_Part_I!BE15)","v":"NA"},0]
[{"$f":"IF(ISBLANK(Sheet1!A27),\" \",Sheet1!A27)","v":8},{"$f":"IF(ISBLANK(Sheet1!B27),\" \",Sheet1!B27)","v":" "},{"$f":"IF(ISBLANK(Sheet1!C27),\" \",Sheet1!C27)","v":" "},{"$f":"IF(CCA_Form_A_Part_I!I16=0,\"NA\",CCA_Form_A_Part_I!I16)","v":"NA"},{"$f":"IF(CCA_Form_A_Part_I!O16=0,\"NA\",CCA_Form_A_Part_I!O16)","v":"NA"},{"$f":"IF(CCA_Form_A_Part_I!U16=0,\"NA\",CCA_Form_A_Part_I!U16)","v":"NA"},{"$f":"IF(CCA_Form_A_Part_I!AA16=0,\"NA\",CCA_Form_A_Part_I!AA16)","v":"NA"},{"$f":"IF(CCA_Form_A_Part_I!AG16=0,\"NA\",CCA_Form_A_Part_I!AG16)","v":"NA"},{"$f":"IF(CCA_Form_A_Part_I!AM16=0,\"NA\",CCA_Form_A_Part_I!AM16)","v":"NA"},{"$f":"IF(CCA_Form_A_Part_I!AS16=0,\"NA\",CCA_Form_A_Part_I!AS16)","v":"NA"},{"$f":"IF(CCA_Form_A_Part_I!AY16=0,\"NA\",CCA_Form_A_Part_I!AY16)","v":"NA"},{"$f":"IF(CCA_Form_A_Part_I!BE16=0,\"NA\",CCA_Form_A_Part_I!BE16)","v":"NA"},0]
[{"$f":"IF(ISBLANK(Sheet1!A28),\" \",Sheet1!A28)","v":9},{"$f":"IF(ISBLANK(Sheet1!B28),\" \",Sheet1!B28)","v":" "},{"$f":"IF(ISBLANK(Sheet1!C28),\" \",Sheet1!C28)","v":" "},{"$f":"IF(CCA_Form_A_Part_I!I17=0,\"NA\",CCA_Form_A_Part_I!I17)","v":"NA"},{"$f":"IF(CCA_Form_A_Part_I!O17=0,\"NA\",CCA_Form_A_Part_I!O17)","v":"NA"},{"$f":"IF(CCA_Form_A_Part_I!U17=0,\"NA\",CCA_Form_A_Part_I!U17)","v":"NA"},{"$f":"IF(CCA_Form_A_Part_I!AA17=0,\"NA\",CCA_Form_A_Part_I!AA17)","v":"NA"},{"$f":"IF(CCA_Form_A_Part_I!AG17=0,\"NA\",CCA_Form_A_Part_I!AG17)","v":"NA"},{"$f":"IF(CCA_Form_A_Part_I!AM17=0,\"NA\",CCA_Form_A_Part_I!AM17)","v":"NA"},{"$f":"IF(CCA_Form_A_Part_I!AS17=0,\"NA\",CCA_Form_A_Part_I!AS17)","v":"NA"},{"$f":"IF(CCA_Form_A_Part_I!AY17=0,\"NA\",CCA_Form_A_Part_I!AY17)","v":"NA"},{"$f":"IF(CCA_Form_A_Part_I!BE17=0,\"NA\",CCA_Form_A_Part_I!BE17)","v":"NA"},0]
[{"$f":"IF(ISBLANK(Sheet1!A29),\" \",Sheet1!A29)","v":10},{"$f":"IF(ISBLANK(Sheet1!B29),\" \",Sheet1!B29)","v":" "},{"$f":"IF(ISBLANK(Sheet1!C29),\" \",Sheet1!C29)","v":" "},{"$f":"IF(CCA_Form_A_Part_I!I18=0,\"NA\",CCA_Form_A_Part_I!I18)","v":"NA"},{"$f":"IF(CCA_Form_A_Part_I!O18=0,\"NA\",CCA_Form_A_Part_I!O18)","v":"NA"},{"$f":"IF(CCA_Form_A_Part_I!U18=0,\"NA\",CCA_Form_A_Part_I!U18)","v":"NA"},{"$f":"IF(CCA_Form_A_Part_I!AA18=0,\"NA\",CCA_Form_A_Part_I!AA18)","v":"NA"},{"$f":"IF(CCA_Form_A_Part_I!AG18=0,\"NA\",CCA_Form_A_Part_I!AG18)","v":"NA"},{"$f":"IF(CCA_Form_A_Part_I!AM18=0,\"NA\",CCA_Form_A_Part_I!AM18)","v":"NA"},{"$f":"IF(CCA_Form_A_Part_I!AS18=0,\"NA\",CCA_Form_A_Part_I!AS18)","v":"NA"},{"$f":"IF(CCA_Form_A_Part_I!AY18=0,\"NA\",CCA_Form_A_Part_I!AY18)","v":"NA"},{"$f":"IF(CCA_Form_A_Part_I!BE18=0,\"NA\",CCA_Form_A_Part_I!BE18)","v":"NA"},0]
[{"$f":"IF(ISBLANK(Sheet1!A30),\" \",Sheet1!A30)","v":11},{"$f":"IF(ISBLANK(Sheet1!B30),\" \",Sheet1!B30)","v":" "},{"$f":"IF(ISBLANK(Sheet1!C30),\" \",Sheet1!C30)","v":" "},{"$f":"IF(CCA_Form_A_Part_I!I19=0,\"NA\",CCA_Form_A_Part_I!I19)","v":"NA"},{"$f":"IF(CCA_Form_A_Part_I!O19=0,\"NA\",CCA_Form_A_Part_I!O19)","v":"NA"},{"$f":"IF(CCA_Form_A_Part_I!U19=0,\"NA\",CCA_Form_A_Part_I!U19)","v":"NA"},{"$f":"IF(CCA_Form_A_Part_I!AA19=0,\"NA\",CCA_Form_A_Part_I!AA19)","v":"NA"},{"$f":"IF(CCA_Form_A_Part_I!AG19=0,\"NA\",CCA_Form_A_Part_I!AG19)","v":"NA"},{"$f":"IF(CCA_Form_A_Part_I!AM19=0,\"NA\",CCA_Form_A_Part_I!AM19)","v":"NA"},{"$f":"IF(CCA_Form_A_Part_I!AS19=0,\"NA\",CCA_Form_A_Part_I!AS19)","v":"NA"},{"$f":"IF(CCA_Form_A_Part_I!AY19=0,\"NA\",CCA_Form_A_Part_I!AY19)","v":"NA"},{"$f":"IF(CCA_Form_A_Part_I!BE19=0,\"NA\",CCA_Form_A_Part_I!BE19)","v":"NA"},0]
[{"$f":"IF(ISBLANK(Sheet1!A31),\" \",Sheet1!A31)","v":12},{"$f":"IF(ISBLANK(Sheet1!B31),\" \",Sheet1!B31)","v":" "},{"$f":"IF(ISBLANK(Sheet1!C31),\" \",Sheet1!C31)","v":" "},{"$f":"IF(CCA_Form_A_Part_I!I20=0,\"NA\",CCA_Form_A_Part_I!I20)","v":"NA"},{"$f":"IF(CCA_Form_A_Part_I!O20=0,\"NA\",CCA_Form_A_Part_I!O20)","v":"NA"},{"$f":"IF(CCA_Form_A_Part_I!U20=0,\"NA\",CCA_Form_A_Part_I!U20)","v":"NA"},{"$f":"IF(CCA_Form_A_Part_I!AA20=0,\"NA\",CCA_Form_A_Part_I!AA20)","v":"NA"},{"$f":"IF(CCA_Form_A_Part_I!AG20=0,\"NA\",CCA_Form_A_Part_I!AG20)","v":"NA"},{"$f":"IF(CCA_Form_A_Part_I!AM20=0,\"NA\",CCA_Form_A_Part_I!AM20)","v":"NA"},{"$f":"IF(CCA_Form_A_Part_I!AS20=0,\"NA\",CCA_Form_A_Part_I!AS20)","v":"NA"},{"$f":"IF(CCA_Form_A_Part_I!AY20=0,\"NA\",CCA_Form_A_Part_I!AY20)","v":"NA"},{"$f":"IF(CCA_Form_A_Part_I!BE20=0,\"NA\",CCA_Form_A_Part_I!BE20)","v":"NA"},0]
[{"$f":"IF(ISBLANK(Sheet1!A32),\" \",Sheet1!A32)","v":13},{"$f":"IF(ISBLANK(Sheet1!B32),\" \",Sheet1!B32)","v":" "},{"$f":"IF(ISBLANK(Sheet1!C32),\" \",Sheet1!C32)","v":" "},{"$f":"IF(CCA_Form_A_Part_I!I21=0,\"NA\",CCA_Form_A_Part_I!I21)","v":"NA"},{"$f":"IF(CCA_Form_A_Part_I!O21=0,\"NA\",CCA_Form_A_Part_I!O21)","v":"NA"},{"$f":"IF(CCA_Form_A_Part_I!U21=0,\"NA\",CCA_Form_A_Part_I!U21)","v":"NA"},{"$f":"IF(CCA_Form_A_Part_I!AA21=0,\"NA\",CCA_Form_A_Part_I!AA21)","v":"NA"},{"$f":"IF(CCA_Form_A_Part_I!AG21=0,\"NA\",CCA_Form_A_Part_I!AG21)","v":"NA"},{"$f":"IF(CCA_Form_A_Part_I!AM21=0,\"NA\",CCA_Form_A_Part_I!AM21)","v":"NA"},{"$f":"IF(CCA_Form_A_Part_I!AS21=0,\"NA\",CCA_Form_A_Part_I!AS21)","v":"NA"},{"$f":"IF(CCA_Form_A_Part_I!AY21=0,\"NA\",CCA_Form_A_Part_I!AY21)","v":"NA"},{"$f":"IF(CCA_Form_A_Part_I!BE21=0,\"NA\",CCA_Form_A_Part_I!BE21)","v":"NA"},0]
[{"$f":"IF(ISBLANK(Sheet1!A33),\" \",Sheet1!A33)","v":14},{"$f":"IF(ISBLANK(Sheet1!B33),\" \",Sheet1!B33)","v":" "},{"$f":"IF(ISBLANK(Sheet1!C33),\" \",Sheet1!C33)","v":" "},{"$f":"IF(CCA_Form_A_Part_I!I22=0,\"NA\",CCA_Form_A_Part_I!I22)","v":"NA"},{"$f":"IF(CCA_Form_A_Part_I!O22=0,\"NA\",CCA_Form_A_Part_I!O22)","v":"NA"},{"$f":"IF(CCA_Form_A_Part_I!U22=0,\"NA\",CCA_Form_A_Part_I!U22)","v":"NA"},{"$f":"IF(CCA_Form_A_Part_I!AA22=0,\"NA\",CCA_Form_A_Part_I!AA22)","v":"NA"},{"$f":"IF(CCA_Form_A_Part_I!AG22=0,\"NA\",CCA_Form_A_Part_I!AG22)","v":"NA"},{"$f":"IF(CCA_Form_A_Part_I!AM22=0,\"NA\",CCA_Form_A_Part_I!AM22)","v":"NA"},{"$f":"IF(CCA_Form_A_Part_I!AS22=0,\"NA\",CCA_Form_A_Part_I!AS22)","v":"NA"},{"$f":"IF(CCA_Form_A_Part_I!AY22=0,\"NA\",CCA_Form_A_Part_I!AY22)","v":"NA"},{"$f":"IF(CCA_Form_A_Part_I!BE22=0,\"NA\",CCA_Form_A_Part_I!BE22)","v":"NA"},0]
[{"$f":"IF(ISBLANK(Sheet1!A34),\" \",Sheet1!A34)","v":15},{"$f":"IF(ISBLANK(Sheet1!B34),\" \",Sheet1!B34)","v":" "},{"$f":"IF(ISBLANK(Sheet1!C34),\" \",Sheet1!C34)","v":" "},{"$f":"IF(CCA_Form_A_Part_I!I23=0,\"NA\",CCA_Form_A_Part_I!I23)","v":"NA"},{"$f":"IF(CCA_Form_A_Part_I!O23=0,\"NA\",CCA_Form_A_Part_I!O23)","v":"NA"},{"$f":"IF(CCA_Form_A_Part_I!U23=0,\"NA\",CCA_Form_A_Part_I!U23)","v":"NA"},{"$f":"IF(CCA_Form_A_Part_I!AA23=0,\"NA\",CCA_Form_A_Part_I!AA23)","v":"NA"},{"$f":"IF(CCA_Form_A_Part_I!AG23=0,\"NA\",CCA_Form_A_Part_I!AG23)","v":"NA"},{"$f":"IF(CCA_Form_A_Part_I!AM23=0,\"NA\",CCA_Form_A_Part_I!AM23)","v":"NA"},{"$f":"IF(CCA_Form_A_Part_I!AS23=0,\"NA\",CCA_Form_A_Part_I!AS23)","v":"NA"},{"$f":"IF(CCA_Form_A_Part_I!AY23=0,\"NA\",CCA_Form_A_Part_I!AY23)","v":"NA"},{"$f":"IF(CCA_Form_A_Part_I!BE23=0,\"NA\",CCA_Form_A_Part_I!BE23)","v":"NA"},0]
[{"$f":"IF(ISBLANK(Sheet1!A35),\" \",Sheet1!A35)","v":16},{"$f":"IF(ISBLANK(Sheet1!B35),\" \",Sheet1!B35)","v":" "},{"$f":"IF(ISBLANK(Sheet1!C35),\" \",Sheet1!C35)","v":" "},{"$f":"IF(CCA_Form_A_Part_I!I24=0,\"NA\",CCA_Form_A_Part_I!I24)","v":"NA"},{"$f":"IF(CCA_Form_A_Part_I!O24=0,\"NA\",CCA_Form_A_Part_I!O24)","v":"NA"},{"$f":"IF(CCA_Form_A_Part_I!U24=0,\"NA\",CCA_Form_A_Part_I!U24)","v":"NA"},{"$f":"IF(CCA_Form_A_Part_I!AA24=0,\"NA\",CCA_Form_A_Part_I!AA24)","v":"NA"},{"$f":"IF(CCA_Form_A_Part_I!AG24=0,\"NA\",CCA_Form_A_Part_I!AG24)","v":"NA"},{"$f":"IF(CCA_Form_A_Part_I!AM24=0,\"NA\",CCA_Form_A_Part_I!AM24)","v":"NA"},{"$f":"IF(CCA_Form_A_Part_I!AS24=0,\"NA\",CCA_Form_A_Part_I!AS24)","v":"NA"},{"$f":"IF(CCA_Form_A_Part_I!AY24=0,\"NA\",CCA_Form_A_Part_I!AY24)","v":"NA"},{"$f":"IF(CCA_Form_A_Part_I!BE24=0,\"NA\",CCA_Form_A_Part_I!BE24)","v":"NA"},0]
[{"$f":"IF(ISBLANK(Sheet1!A36),\" \",Sheet1!A36)","v":17},{"$f":"IF(ISBLANK(Sheet1!B36),\" \",Sheet1!B36)","v":" "},{"$f":"IF(ISBLANK(Sheet1!C36),\" \",Sheet1!C36)","v":" "},{"$f":"IF(CCA_Form_A_Part_I!I25=0,\"NA\",CCA_Form_A_Part_I!I25)","v":"NA"},{"$f":"IF(CCA_Form_A_Part_I!O25=0,\"NA\",CCA_Form_A_Part_I!O25)","v":"NA"},{"$f":"IF(CCA_Form_A_Part_I!U25=0,\"NA\",CCA_Form_A_Part_I!U25)","v":"NA"},{"$f":"IF(CCA_Form_A_Part_I!AA25=0,\"NA\",CCA_Form_A_Part_I!AA25)","v":"NA"},{"$f":"IF(CCA_Form_A_Part_I!AG25=0,\"NA\",CCA_Form_A_Part_I!AG25)","v":"NA"},{"$f":"IF(CCA_Form_A_Part_I!AM25=0,\"NA\",CCA_Form_A_Part_I!AM25)","v":"NA"},{"$f":"IF(CCA_Form_A_Part_I!AS25=0,\"NA\",CCA_Form_A_Part_I!AS25)","v":"NA"},{"$f":"IF(CCA_Form_A_Part_I!AY25=0,\"NA\",CCA_Form_A_Part_I!AY25)","v":"NA"},{"$f":"IF(CCA_Form_A_Part_I!BE25=0,\"NA\",CCA_Form_A_Part_I!BE25)","v":"NA"},0]
[{"$f":"IF(ISBLANK(Sheet1!A37),\" \",Sheet1!A37)","v":18},{"$f":"IF(ISBLANK(Sheet1!B37),\" \",Sheet1!B37)","v":" "},{"$f":"IF(ISBLANK(Sheet1!C37),\" \",Sheet1!C37)","v":" "},{"$f":"IF(CCA_Form_A_Part_I!I26=0,\"NA\",CCA_Form_A_Part_I!I26)","v":"NA"},{"$f":"IF(CCA_Form_A_Part_I!O26=0,\"NA\",CCA_Form_A_Part_I!O26)","v":"NA"},{"$f":"IF(CCA_Form_A_Part_I!U26=0,\"NA\",CCA_Form_A_Part_I!U26)","v":"NA"},{"$f":"IF(CCA_Form_A_Part_I!AA26=0,\"NA\",CCA_Form_A_Part_I!AA26)","v":"NA"},{"$f":"IF(CCA_Form_A_Part_I!AG26=0,\"NA\",CCA_Form_A_Part_I!AG26)","v":"NA"},{"$f":"IF(CCA_Form_A_Part_I!AM26=0,\"NA\",CCA_Form_A_Part_I!AM26)","v":"NA"},{"$f":"IF(CCA_Form_A_Part_I!AS26=0,\"NA\",CCA_Form_A_Part_I!AS26)","v":"NA"},{"$f":"IF(CCA_Form_A_Part_I!AY26=0,\"NA\",CCA_Form_A_Part_I!AY26)","v":"NA"},{"$f":"IF(CCA_Form_A_Part_I!BE26=0,\"NA\",CCA_Form_A_Part_I!BE26)","v":"NA"},0]
[{"$f":"IF(ISBLANK(Sheet1!A38),\" \",Sheet1!A38)","v":19},{"$f":"IF(ISBLANK(Sheet1!B38),\" \",Sheet1!B38)","v":" "},{"$f":"IF(ISBLANK(Sheet1!C38),\" \",Sheet1!C38)","v":" "},{"$f":"IF(CCA_Form_A_Part_I!I27=0,\"NA\",CCA_Form_A_Part_I!I27)","v":"NA"},{"$f":"IF(CCA_Form_A_Part_I!O27=0,\"NA\",CCA_Form_A_Part_I!O27)","v":"NA"},{"$f":"IF(CCA_Form_A_Part_I!U27=0,\"NA\",CCA_Form_A_Part_I!U27)","v":"NA"},{"$f":"IF(CCA_Form_A_Part_I!AA27=0,\"NA\",CCA_Form_A_Part_I!AA27)","v":"NA"},{"$f":"IF(CCA_Form_A_Part_I!AG27=0,\"NA\",CCA_Form_A_Part_I!AG27)","v":"NA"},{"$f":"IF(CCA_Form_A_Part_I!AM27=0,\"NA\",CCA_Form_A_Part_I!AM27)","v":"NA"},{"$f":"IF(CCA_Form_A_Part_I!AS27=0,\"NA\",CCA_Form_A_Part_I!AS27)","v":"NA"},{"$f":"IF(CCA_Form_A_Part_I!AY27=0,\"NA\",CCA_Form_A_Part_I!AY27)","v":"NA"},{"$f":"IF(CCA_Form_A_Part_I!BE27=0,\"NA\",CCA_Form_A_Part_I!BE27)","v":"NA"},0]
[{"$f":"IF(ISBLANK(Sheet1!A39),\" \",Sheet1!A39)","v":20},{"$f":"IF(ISBLANK(Sheet1!B39),\" \",Sheet1!B39)","v":" "},{"$f":"IF(ISBLANK(Sheet1!C39),\" \",Sheet1!C39)","v":" "},{"$f":"IF(CCA_Form_A_Part_I!I28=0,\"NA\",CCA_Form_A_Part_I!I28)","v":"NA"},{"$f":"IF(CCA_Form_A_Part_I!O28=0,\"NA\",CCA_Form_A_Part_I!O28)","v":"NA"},{"$f":"IF(CCA_Form_A_Part_I!U28=0,\"NA\",CCA_Form_A_Part_I!U28)","v":"NA"},{"$f":"IF(CCA_Form_A_Part_I!AA28=0,\"NA\",CCA_Form_A_Part_I!AA28)","v":"NA"},{"$f":"IF(CCA_Form_A_Part_I!AG28=0,\"NA\",CCA_Form_A_Part_I!AG28)","v":"NA"},{"$f":"IF(CCA_Form_A_Part_I!AM28=0,\"NA\",CCA_Form_A_Part_I!AM28)","v":"NA"},{"$f":"IF(CCA_Form_A_Part_I!AS28=0,\"NA\",CCA_Form_A_Part_I!AS28)","v":"NA"},{"$f":"IF(CCA_Form_A_Part_I!AY28=0,\"NA\",CCA_Form_A_Part_I!AY28)","v":"NA"},{"$f":"IF(CCA_Form_A_Part_I!BE28=0,\"NA\",CCA_Form_A_Part_I!BE28)","v":"NA"},0]
[{"$f":"IF(ISBLANK(Sheet1!A40),\" \",Sheet1!A40)","v":21},{"$f":"IF(ISBLANK(Sheet1!B40),\" \",Sheet1!B40)","v":" "},{"$f":"IF(ISBLANK(Sheet1!C40),\" \",Sheet1!C40)","v":" "},{"$f":"IF(CCA_Form_A_Part_I!I29=0,\"NA\",CCA_Form_A_Part_I!I29)","v":"NA"},{"$f":"IF(CCA_Form_A_Part_I!O29=0,\"NA\",CCA_Form_A_Part_I!O29)","v":"NA"},{"$f":"IF(CCA_Form_A_Part_I!U29=0,\"NA\",CCA_Form_A_Part_I!U29)","v":"NA"},{"$f":"IF(CCA_Form_A_Part_I!AA29=0,\"NA\",CCA_Form_A_Part_I!AA29)","v":"NA"},{"$f":"IF(CCA_Form_A_Part_I!AG29=0,\"NA\",CCA_Form_A_Part_I!AG29)","v":"NA"},{"$f":"IF(CCA_Form_A_Part_I!AM29=0,\"NA\",CCA_Form_A_Part_I!AM29)","v":"NA"},{"$f":"IF(CCA_Form_A_Part_I!AS29=0,\"NA\",CCA_Form_A_Part_I!AS29)","v":"NA"},{"$f":"IF(CCA_Form_A_Part_I!AY29=0,\"NA\",CCA_Form_A_Part_I!AY29)","v":"NA"},{"$f":"IF(CCA_Form_A_Part_I!BE29=0,\"NA\",CCA_Form_A_Part_I!BE29)","v":"NA"},0]
[{"$f":"IF(ISBLANK(Sheet1!A41),\" \",Sheet1!A41)","v":22},{"$f":"IF(ISBLANK(Sheet1!B41),\" \",Sheet1!B41)","v":" "},{"$f":"IF(ISBLANK(Sheet1!C41),\" \",Sheet1!C41)","v":" "},{"$f":"IF(CCA_Form_A_Part_I!I30=0,\"NA\",CCA_Form_A_Part_I!I30)","v":"NA"},{"$f":"IF(CCA_Form_A_Part_I!O30=0,\"NA\",CCA_Form_A_Part_I!O30)","v":"NA"},{"$f":"IF(CCA_Form_A_Part_I!U30=0,\"NA\",CCA_Form_A_Part_I!U30)","v":"NA"},{"$f":"IF(CCA_Form_A_Part_I!AA30=0,\"NA\",CCA_Form_A_Part_I!AA30)","v":"NA"},{"$f":"IF(CCA_Form_A_Part_I!AG30=0,\"NA\",CCA_Form_A_Part_I!AG30)","v":"NA"},{"$f":"IF(CCA_Form_A_Part_I!AM30=0,\"NA\",CCA_Form_A_Part_I!AM30)","v":"NA"},{"$f":"IF(CCA_Form_A_Part_I!AS30=0,\"NA\",CCA_Form_A_Part_I!AS30)","v":"NA"},{"$f":"IF(CCA_Form_A_Part_I!AY30=0,\"NA\",CCA_Form_A_Part_I!AY30)","v":"NA"},{"$f":"IF(CCA_Form_A_Part_I!BE30=0,\"NA\",CCA_Form_A_Part_I!BE30)","v":"NA"},0]
[{"$f":"IF(ISBLANK(Sheet1!A42),\" \",Sheet1!A42)","v":23},{"$f":"IF(ISBLANK(Sheet1!B42),\" \",Sheet1!B42)","v":" "},{"$f":"IF(ISBLANK(Sheet1!C42),\" \",Sheet1!C42)","v":" "},{"$f":"IF(CCA_Form_A_Part_I!I31=0,\"NA\",CCA_Form_A_Part_I!I31)","v":"NA"},{"$f":"IF(CCA_Form_A_Part_I!O31=0,\"NA\",CCA_Form_A_Part_I!O31)","v":"NA"},{"$f":"IF(CCA_Form_A_Part_I!U31=0,\"NA\",CCA_Form_A_Part_I!U31)","v":"NA"},{"$f":"IF(CCA_Form_A_Part_I!AA31=0,\"NA\",CCA_Form_A_Part_I!AA31)","v":"NA"},{"$f":"IF(CCA_Form_A_Part_I!AG31=0,\"NA\",CCA_Form_A_Part_I!AG31)","v":"NA"},{"$f":"IF(CCA_Form_A_Part_I!AM31=0,\"NA\",CCA_Form_A_Part_I!AM31)","v":"NA"},{"$f":"IF(CCA_Form_A_Part_I!AS31=0,\"NA\",CCA_Form_A_Part_I!AS31)","v":"NA"},{"$f":"IF(CCA_Form_A_Part_I!AY31=0,\"NA\",CCA_Form_A_Part_I!AY31)","v":"NA"},{"$f":"IF(CCA_Form_A_Part_I!BE31=0,\"NA\",CCA_Form_A_Part_I!BE31)","v":"NA"},0]
[{"$f":"IF(ISBLANK(Sheet1!A43),\" \",Sheet1!A43)","v":24},{"$f":"IF(ISBLANK(Sheet1!B43),\" \",Sheet1!B43)","v":" "},{"$f":"IF(ISBLANK(Sheet1!C43),\" \",Sheet1!C43)","v":" "},{"$f":"IF(CCA_Form_A_Part_I!I32=0,\"NA\",CCA_Form_A_Part_I!I32)","v":"NA"},{"$f":"IF(CCA_Form_A_Part_I!O32=0,\"NA\",CCA_Form_A_Part_I!O32)","v":"NA"},{"$f":"IF(CCA_Form_A_Part_I!U32=0,\"NA\",CCA_Form_A_Part_I!U32)","v":"NA"},{"$f":"IF(CCA_Form_A_Part_I!AA32=0,\"NA\",CCA_Form_A_Part_I!AA32)","v":"NA"},{"$f":"IF(CCA_Form_A_Part_I!AG32=0,\"NA\",CCA_Form_A_Part_I!AG32)","v":"NA"},{"$f":"IF(CCA_Form_A_Part_I!AM32=0,\"NA\",CCA_Form_A_Part_I!AM32)","v":"NA"},{"$f":"IF(CCA_Form_A_Part_I!AS32=0,\"NA\",CCA_Form_A_Part_I!AS32)","v":"NA"},{"$f":"IF(CCA_Form_A_Part_I!AY32=0,\"NA\",CCA_Form_A_Part_I!AY32)","v":"NA"},{"$f":"IF(CCA_Form_A_Part_I!BE32=0,\"NA\",CCA_Form_A_Part_I!BE32)","v":"NA"},0]
[{"$f":"IF(ISBLANK(Sheet1!A44),\" \",Sheet1!A44)","v":25},{"$f":"IF(ISBLANK(Sheet1!B44),\" \",Sheet1!B44)","v":" "},{"$f":"IF(ISBLANK(Sheet1!C44),\" \",Sheet1!C44)","v":" "},{"$f":"IF(CCA_Form_A_Part_I!I33=0,\"NA\",CCA_Form_A_Part_I!I33)","v":"NA"},{"$f":"IF(CCA_Form_A_Part_I!O33=0,\"NA\",CCA_Form_A_Part_I!O33)","v":"NA"},{"$f":"IF(CCA_Form_A_Part_I!U33=0,\"NA\",CCA_Form_A_Part_I!U33)","v":"NA"},{"$f":"IF(CCA_Form_A_Part_I!AA33=0,\"NA\",CCA_Form_A_Part_I!AA33)","v":"NA"},{"$f":"IF(CCA_Form_A_Part_I!AG33=0,\"NA\",CCA_Form_A_Part_I!AG33)","v":"NA"},{"$f":"IF(CCA_Form_A_Part_I!AM33=0,\"NA\",CCA_Form_A_Part_I!AM33)","v":"NA"},{"$f":"IF(CCA_Form_A_Part_I!AS33=0,\"NA\",CCA_Form_A_Part_I!AS33)","v":"NA"},{"$f":"IF(CCA_Form_A_Part_I!AY33=0,\"NA\",CCA_Form_A_Part_I!AY33)","v":"NA"},{"$f":"IF(CCA_Form_A_Part_I!BE33=0,\"NA\",CCA_Form_A_Part_I!BE33)","v":"NA"},0]
[{"$f":"IF(ISBLANK(Sheet1!A45),\" \",Sheet1!A45)","v":26},{"$f":"IF(ISBLANK(Sheet1!B45),\" \",Sheet1!B45)","v":" "},{"$f":"IF(ISBLANK(Sheet1!C45),\" \",Sheet1!C45)","v":" "},{"$f":"IF(CCA_Form_A_Part_I!I34=0,\"NA\",CCA_Form_A_Part_I!I34)","v":"NA"},{"$f":"IF(CCA_Form_A_Part_I!O34=0,\"NA\",CCA_Form_A_Part_I!O34)","v":"NA"},{"$f":"IF(CCA_Form_A_Part_I!U34=0,\"NA\",CCA_Form_A_Part_I!U34)","v":"NA"},{"$f":"IF(CCA_Form_A_Part_I!AA34=0,\"NA\",CCA_Form_A_Part_I!AA34)","v":"NA"},{"$f":"IF(CCA_Form_A_Part_I!AG34=0,\"NA\",CCA_Form_A_Part_I!AG34)","v":"NA"},{"$f":"IF(CCA_Form_A_Part_I!AM34=0,\"NA\",CCA_Form_A_Part_I!AM34)","v":"NA"},{"$f":"IF(CCA_Form_A_Part_I!AS34=0,\"NA\",CCA_Form_A_Part_I!AS34)","v":"NA"},{"$f":"IF(CCA_Form_A_Part_I!AY34=0,\"NA\",CCA_Form_A_Part_I!AY34)","v":"NA"},{"$f":"IF(CCA_Form_A_Part_I!BE34=0,\"NA\",CCA_Form_A_Part_I!BE34)","v":"NA"},0]
[{"$f":"IF(ISBLANK(Sheet1!A46),\" \",Sheet1!A46)","v":27},{"$f":"IF(ISBLANK(Sheet1!B46),\" \",Sheet1!B46)","v":" "},{"$f":"IF(ISBLANK(Sheet1!C46),\" \",Sheet1!C46)","v":" "},{"$f":"IF(CCA_Form_A_Part_I!I35=0,\"NA\",CCA_Form_A_Part_I!I35)","v":"NA"},{"$f":"IF(CCA_Form_A_Part_I!O35=0,\"NA\",CCA_Form_A_Part_I!O35)","v":"NA"},{"$f":"IF(CCA_Form_A_Part_I!U35=0,\"NA\",CCA_Form_A_Part_I!U35)","v":"NA"},{"$f":"IF(CCA_Form_A_Part_I!AA35=0,\"NA\",CCA_Form_A_Part_I!AA35)","v":"NA"},{"$f":"IF(CCA_Form_A_Part_I!AG35=0,\"NA\",CCA_Form_A_Part_I!AG35)","v":"NA"},{"$f":"IF(CCA_Form_A_Part_I!AM35=0,\"NA\",CCA_Form_A_Part_I!AM35)","v":"NA"},{"$f":"IF(CCA_Form_A_Part_I!AS35=0,\"NA\",CCA_Form_A_Part_I!AS35)","v":"NA"},{"$f":"IF(CCA_Form_A_Part_I!AY35=0,\"NA\",CCA_Form_A_Part_I!AY35)","v":"NA"},{"$f":"IF(CCA_Form_A_Part_I!BE35=0,\"NA\",CCA_Form_A_Part_I!BE35)","v":"NA"},0]
[{"$f":"IF(ISBLANK(Sheet1!A47),\" \",Sheet1!A47)","v":28},{"$f":"IF(ISBLANK(Sheet1!B47),\" \",Sheet1!B47)","v":" "},{"$f":"IF(ISBLANK(Sheet1!C47),\" \",Sheet1!C47)","v":" "},{"$f":"IF(CCA_Form_A_Part_I!I36=0,\"NA\",CCA_Form_A_Part_I!I36)","v":"NA"},{"$f":"IF(CCA_Form_A_Part_I!O36=0,\"NA\",CCA_Form_A_Part_I!O36)","v":"NA"},{"$f":"IF(CCA_Form_A_Part_I!U36=0,\"NA\",CCA_Form_A_Part_I!U36)","v":"NA"},{"$f":"IF(CCA_Form_A_Part_I!AA36=0,\"NA\",CCA_Form_A_Part_I!AA36)","v":"NA"},{"$f":"IF(CCA_Form_A_Part_I!AG36=0,\"NA\",CCA_Form_A_Part_I!AG36)","v":"NA"},{"$f":"IF(CCA_Form_A_Part_I!AM36=0,\"NA\",CCA_Form_A_Part_I!AM36)","v":"NA"},{"$f":"IF(CCA_Form_A_Part_I!AS36=0,\"NA\",CCA_Form_A_Part_I!AS36)","v":"NA"},{"$f":"IF(CCA_Form_A_Part_I!AY36=0,\"NA\",CCA_Form_A_Part_I!AY36)","v":"NA"},{"$f":"IF(CCA_Form_A_Part_I!BE36=0,\"NA\",CCA_Form_A_Part_I!BE36)","v":"NA"},0]
[{"$f":"IF(ISBLANK(Sheet1!A48),\" \",Sheet1!A48)","v":29},{"$f":"IF(ISBLANK(Sheet1!B48),\" \",Sheet1!B48)","v":" "},{"$f":"IF(ISBLANK(Sheet1!C48),\" \",Sheet1!C48)","v":" "},{"$f":"IF(CCA_Form_A_Part_I!I37=0,\"NA\",CCA_Form_A_Part_I!I37)","v":"NA"},{"$f":"IF(CCA_Form_A_Part_I!O37=0,\"NA\",CCA_Form_A_Part_I!O37)","v":"NA"},{"$f":"IF(CCA_Form_A_Part_I!U37=0,\"NA\",CCA_Form_A_Part_I!U37)","v":"NA"},{"$f":"IF(CCA_Form_A_Part_I!AA37=0,\"NA\",CCA_Form_A_Part_I!AA37)","v":"NA"},{"$f":"IF(CCA_Form_A_Part_I!AG37=0,\"NA\",CCA_Form_A_Part_I!AG37)","v":"NA"},{"$f":"IF(CCA_Form_A_Part_I!AM37=0,\"NA\",CCA_Form_A_Part_I!AM37)","v":"NA"},{"$f":"IF(CCA_Form_A_Part_I!AS37=0,\"NA\",CCA_Form_A_Part_I!AS37)","v":"NA"},{"$f":"IF(CCA_Form_A_Part_I!AY37=0,\"NA\",CCA_Form_A_Part_I!AY37)","v":"NA"},{"$f":"IF(CCA_Form_A_Part_I!BE37=0,\"NA\",CCA_Form_A_Part_I!BE37)","v":"NA"},0]
[{"$f":"IF(ISBLANK(Sheet1!A49),\" \",Sheet1!A49)","v":30},{"$f":"IF(ISBLANK(Sheet1!B49),\" \",Sheet1!B49)","v":" "},{"$f":"IF(ISBLANK(Sheet1!C49),\" \",Sheet1!C49)","v":" "},{"$f":"IF(CCA_Form_A_Part_I!I38=0,\"NA\",CCA_Form_A_Part_I!I38)","v":"NA"},{"$f":"IF(CCA_Form_A_Part_I!O38=0,\"NA\",CCA_Form_A_Part_I!O38)","v":"NA"},{"$f":"IF(CCA_Form_A_Part_I!U38=0,\"NA\",CCA_Form_A_Part_I!U38)","v":"NA"},{"$f":"IF(CCA_Form_A_Part_I!AA38=0,\"NA\",CCA_Form_A_Part_I!AA38)","v":"NA"},{"$f":"IF(CCA_Form_A_Part_I!AG38=0,\"NA\",CCA_Form_A_Part_I!AG38)","v":"NA"},{"$f":"IF(CCA_Form_A_Part_I!AM38=0,\"NA\",CCA_Form_A_Part_I!AM38)","v":"NA"},{"$f":"IF(CCA_Form_A_Part_I!AS38=0,\"NA\",CCA_Form_A_Part_I!AS38)","v":"NA"},{"$f":"IF(CCA_Form_A_Part_I!AY38=0,\"NA\",CCA_Form_A_Part_I!AY38)","v":"NA"},{"$f":"IF(CCA_Form_A_Part_I!BE38=0,\"NA\",CCA_Form_A_Part_I!BE38)","v":"NA"},0]
[{"$f":"IF(ISBLANK(Sheet1!A50),\" \",Sheet1!A50)","v":31},{"$f":"IF(ISBLANK(Sheet1!B50),\" \",Sheet1!B50)","v":" "},{"$f":"IF(ISBLANK(Sheet1!C50),\" \",Sheet1!C50)","v":" "},{"$f":"IF(CCA_Form_A_Part_I!I39=0,\"NA\",CCA_Form_A_Part_I!I39)","v":"NA"},{"$f":"IF(CCA_Form_A_Part_I!O39=0,\"NA\",CCA_Form_A_Part_I!O39)","v":"NA"},{"$f":"IF(CCA_Form_A_Part_I!U39=0,\"NA\",CCA_Form_A_Part_I!U39)","v":"NA"},{"$f":"IF(CCA_Form_A_Part_I!AA39=0,\"NA\",CCA_Form_A_Part_I!AA39)","v":"NA"},{"$f":"IF(CCA_Form_A_Part_I!AG39=0,\"NA\",CCA_Form_A_Part_I!AG39)","v":"NA"},{"$f":"IF(CCA_Form_A_Part_I!AM39=0,\"NA\",CCA_Form_A_Part_I!AM39)","v":"NA"},{"$f":"IF(CCA_Form_A_Part_I!AS39=0,\"NA\",CCA_Form_A_Part_I!AS39)","v":"NA"},{"$f":"IF(CCA_Form_A_Part_I!AY39=0,\"NA\",CCA_Form_A_Part_I!AY39)","v":"NA"},{"$f":"IF(CCA_Form_A_Part_I!BE39=0,\"NA\",CCA_Form_A_Part_I!BE39)","v":"NA"},0]
[{"$f":"IF(ISBLANK(Sheet1!A51),\" \",Sheet1!A51)","v":32},{"$f":"IF(ISBLANK(Sheet1!B51),\" \",Sheet1!B51)","v":" "},{"$f":"IF(ISBLANK(Sheet1!C51),\" \",Sheet1!C51)","v":" "},{"$f":"IF(CCA_Form_A_Part_I!I40=0,\"NA\",CCA_Form_A_Part_I!I40)","v":"NA"},{"$f":"IF(CCA_Form_A_Part_I!O40=0,\"NA\",CCA_Form_A_Part_I!O40)","v":"NA"},{"$f":"IF(CCA_Form_A_Part_I!U40=0,\"NA\",CCA_Form_A_Part_I!U40)","v":"NA"},{"$f":"IF(CCA_Form_A_Part_I!AA40=0,\"NA\",CCA_Form_A_Part_I!AA40)","v":"NA"},{"$f":"IF(CCA_Form_A_Part_I!AG40=0,\"NA\",CCA_Form_A_Part_I!AG40)","v":"NA"},{"$f":"IF(CCA_Form_A_Part_I!AM40=0,\"NA\",CCA_Form_A_Part_I!AM40)","v":"NA"},{"$f":"IF(CCA_Form_A_Part_I!AS40=0,\"NA\",CCA_Form_A_Part_I!AS40)","v":"NA"},{"$f":"IF(CCA_Form_A_Part_I!AY40=0,\"NA\",CCA_Form_A_Part_I!AY40)","v":"NA"},{"$f":"IF(CCA_Form_A_Part_I!BE40=0,\"NA\",CCA_Form_A_Part_I!BE40)","v":"NA"},0]
[{"$f":"IF(ISBLANK(Sheet1!A52),\" \",Sheet1!A52)","v":33},{"$f":"IF(ISBLANK(Sheet1!B52),\" \",Sheet1!B52)","v":" "},{"$f":"IF(ISBLANK(Sheet1!C52),\" \",Sheet1!C52)","v":" "},{"$f":"IF(CCA_Form_A_Part_I!I41=0,\"NA\",CCA_Form_A_Part_I!I41)","v":"NA"},{"$f":"IF(CCA_Form_A_Part_I!O41=0,\"NA\",CCA_Form_A_Part_I!O41)","v":"NA"},{"$f":"IF(CCA_Form_A_Part_I!U41=0,\"NA\",CCA_Form_A_Part_I!U41)","v":"NA"},{"$f":"IF(CCA_Form_A_Part_I!AA41=0,\"NA\",CCA_Form_A_Part_I!AA41)","v":"NA"},{"$f":"IF(CCA_Form_A_Part_I!AG41=0,\"NA\",CCA_Form_A_Part_I!AG41)","v":"NA"},{"$f":"IF(CCA_Form_A_Part_I!AM41=0,\"NA\",CCA_Form_A_Part_I!AM41)","v":"NA"},{"$f":"IF(CCA_Form_A_Part_I!AS41=0,\"NA\",CCA_Form_A_Part_I!AS41)","v":"NA"},{"$f":"IF(CCA_Form_A_Part_I!AY41=0,\"NA\",CCA_Form_A_Part_I!AY41)","v":"NA"},{"$f":"IF(CCA_Form_A_Part_I!BE41=0,\"NA\",CCA_Form_A_Part_I!BE41)","v":"NA"},0]
[{"$f":"IF(ISBLANK(Sheet1!A53),\" \",Sheet1!A53)","v":34},{"$f":"IF(ISBLANK(Sheet1!B53),\" \",Sheet1!B53)","v":" "},{"$f":"IF(ISBLANK(Sheet1!C53),\" \",Sheet1!C53)","v":" "},{"$f":"IF(CCA_Form_A_Part_I!I42=0,\"NA\",CCA_Form_A_Part_I!I42)","v":"NA"},{"$f":"IF(CCA_Form_A_Part_I!O42=0,\"NA\",CCA_Form_A_Part_I!O42)","v":"NA"},{"$f":"IF(CCA_Form_A_Part_I!U42=0,\"NA\",CCA_Form_A_Part_I!U42)","v":"NA"},{"$f":"IF(CCA_Form_A_Part_I!AA42=0,\"NA\",CCA_Form_A_Part_I!AA42)","v":"NA"},{"$f":"IF(CCA_Form_A_Part_I!AG42=0,\"NA\",CCA_Form_A_Part_I!AG42)","v":"NA"},{"$f":"IF(CCA_Form_A_Part_I!AM42=0,\"NA\",CCA_Form_A_Part_I!AM42)","v":"NA"},{"$f":"IF(CCA_Form_A_Part_I!AS42=0,\"NA\",CCA_Form_A_Part_I!AS42)","v":"NA"},{"$f":"IF(CCA_Form_A_Part_I!AY42=0,\"NA\",CCA_Form_A_Part_I!AY42)","v":"NA"},{"$f":"IF(CCA_Form_A_Part_I!BE42=0,\"NA\",CCA_Form_A_Part_I!BE42)","v":"NA"},0]
[{"$f":"IF(ISBLANK(Sheet1!A54),\" \",Sheet1!A54)","v":35},{"$f":"IF(ISBLANK(Sheet1!B54),\" \",Sheet1!B54)","v":" "},{"$f":"IF(ISBLANK(Sheet1!C54),\" \",Sheet1!C54)","v":" "},{"$f":"IF(CCA_Form_A_Part_I!I43=0,\"NA\",CCA_Form_A_Part_I!I43)","v":"NA"},{"$f":"IF(CCA_Form_A_Part_I!O43=0,\"NA\",CCA_Form_A_Part_I!O43)","v":"NA"},{"$f":"IF(CCA_Form_A_Part_I!U43=0,\"NA\",CCA_Form_A_Part_I!U43)","v":"NA"},{"$f":"IF(CCA_Form_A_Part_I!AA43=0,\"NA\",CCA_Form_A_Part_I!AA43)","v":"NA"},{"$f":"IF(CCA_Form_A_Part_I!AG43=0,\"NA\",CCA_Form_A_Part_I!AG43)","v":"NA"},{"$f":"IF(CCA_Form_A_Part_I!AM43=0,\"NA\",CCA_Form_A_Part_I!AM43)","v":"NA"},{"$f":"IF(CCA_Form_A_Part_I!AS43=0,\"NA\",CCA_Form_A_Part_I!AS43)","v":"NA"},{"$f":"IF(CCA_Form_A_Part_I!AY43=0,\"NA\",CCA_Form_A_Part_I!AY43)","v":"NA"},{"$f":"IF(CCA_Form_A_Part_I!BE43=0,\"NA\",CCA_Form_A_Part_I!BE43)","v":"NA"},0]
[{"$f":"IF(ISBLANK(Sheet1!A55),\" \",Sheet1!A55)","v":36},{"$f":"IF(ISBLANK(Sheet1!B55),\" \",Sheet1!B55)","v":" "},{"$f":"IF(ISBLANK(Sheet1!C55),\" \",Sheet1!C55)","v":" "},{"$f":"IF(CCA_Form_A_Part_I!I44=0,\"NA\",CCA_Form_A_Part_I!I44)","v":"NA"},{"$f":"IF(CCA_Form_A_Part_I!O44=0,\"NA\",CCA_Form_A_Part_I!O44)","v":"NA"},{"$f":"IF(CCA_Form_A_Part_I!U44=0,\"NA\",CCA_Form_A_Part_I!U44)","v":"NA"},{"$f":"IF(CCA_Form_A_Part_I!AA44=0,\"NA\",CCA_Form_A_Part_I!AA44)","v":"NA"},{"$f":"IF(CCA_Form_A_Part_I!AG44=0,\"NA\",CCA_Form_A_Part_I!AG44)","v":"NA"},{"$f":"IF(CCA_Form_A_Part_I!AM44=0,\"NA\",CCA_Form_A_Part_I!AM44)","v":"NA"},{"$f":"IF(CCA_Form_A_Part_I!AS44=0,\"NA\",CCA_Form_A_Part_I!AS44)","v":"NA"},{"$f":"IF(CCA_Form_A_Part_I!AY44=0,\"NA\",CCA_Form_A_Part_I!AY44)","v":"NA"},{"$f":"IF(CCA_Form_A_Part_I!BE44=0,\"NA\",CCA_Form_A_Part_I!BE44)","v":"NA"},{"$f":"SUM(D46:L46)","v":0}]
[{"$f":"IF(ISBLANK(Sheet1!A56),\" \",Sheet1!A56)","v":37},{"$f":"IF(ISBLANK(Sheet1!B56),\" \",Sheet1!B56)","v":" "},{"$f":"IF(ISBLANK(Sheet1!C56),\" \",Sheet1!C56)","v":" "},{"$f":"IF(CCA_Form_A_Part_I!I45=0,\"NA\",CCA_Form_A_Part_I!I45)","v":"NA"},{"$f":"IF(CCA_Form_A_Part_I!O45=0,\"NA\",CCA_Form_A_Part_I!O45)","v":"NA"},{"$f":"IF(CCA_Form_A_Part_I!U45=0,\"NA\",CCA_Form_A_Part_I!U45)","v":"NA"},{"$f":"IF(CCA_Form_A_Part_I!AA45=0,\"NA\",CCA_Form_A_Part_I!AA45)","v":"NA"},{"$f":"IF(CCA_Form_A_Part_I!AG45=0,\"NA\",CCA_Form_A_Part_I!AG45)","v":"NA"},{"$f":"IF(CCA_Form_A_Part_I!AM45=0,\"NA\",CCA_Form_A_Part_I!AM45)","v":"NA"},{"$f":"IF(CCA_Form_A_Part_I!AS45=0,\"NA\",CCA_Form_A_Part_I!AS45)","v":"NA"},{"$f":"IF(CCA_Form_A_Part_I!AY45=0,\"NA\",CCA_Form_A_Part_I!AY45)","v":"NA"},{"$f":"IF(CCA_Form_A_Part_I!BE45=0,\"NA\",CCA_Form_A_Part_I!BE45)","v":"NA"},{"$f":"SUM(D47:L47)","v":0}]
[{"$f":"IF(ISBLANK(Sheet1!A57),\" \",Sheet1!A57)","v":38},{"$f":"IF(ISBLANK(Sheet1!B57),\" \",Sheet1!B57)","v":" "},{"$f":"IF(ISBLANK(Sheet1!C57),\" \",Sheet1!C57)","v":" "},{"$f":"IF(CCA_Form_A_Part_I!I46=0,\"NA\",CCA_Form_A_Part_I!I46)","v":"NA"},{"$f":"IF(CCA_Form_A_Part_I!O46=0,\"NA\",CCA_Form_A_Part_I!O46)","v":"NA"},{"$f":"IF(CCA_Form_A_Part_I!U46=0,\"NA\",CCA_Form_A_Part_I!U46)","v":"NA"},{"$f":"IF(CCA_Form_A_Part_I!AA46=0,\"NA\",CCA_Form_A_Part_I!AA46)","v":"NA"},{"$f":"IF(CCA_Form_A_Part_I!AG46=0,\"NA\",CCA_Form_A_Part_I!AG46)","v":"NA"},{"$f":"IF(CCA_Form_A_Part_I!AM46=0,\"NA\",CCA_Form_A_Part_I!AM46)","v":"NA"},{"$f":"IF(CCA_Form_A_Part_I!AS46=0,\"NA\",CCA_Form_A_Part_I!AS46)","v":"NA"},{"$f":"IF(CCA_Form_A_Part_I!AY46=0,\"NA\",CCA_Form_A_Part_I!AY46)","v":"NA"},{"$f":"IF(CCA_Form_A_Part_I!BE46=0,\"NA\",CCA_Form_A_Part_I!BE46)","v":"NA"},0]
[{"$f":"IF(ISBLANK(Sheet1!A58),\" \",Sheet1!A58)","v":39},{"$f":"IF(ISBLANK(Sheet1!B58),\" \",Sheet1!B58)","v":" "},{"$f":"IF(ISBLANK(Sheet1!C58),\" \",Sheet1!C58)","v":" "},{"$f":"IF(CCA_Form_A_Part_I!I47=0,\"NA\",CCA_Form_A_Part_I!I47)","v":"NA"},{"$f":"IF(CCA_Form_A_Part_I!O47=0,\"NA\",CCA_Form_A_Part_I!O47)","v":"NA"},{"$f":"IF(CCA_Form_A_Part_I!U47=0,\"NA\",CCA_Form_A_Part_I!U47)","v":"NA"},{"$f":"IF(CCA_Form_A_Part_I!AA47=0,\"NA\",CCA_Form_A_Part_I!AA47)","v":"NA"},{"$f":"IF(CCA_Form_A_Part_I!AG47=0,\"NA\",CCA_Form_A_Part_I!AG47)","v":"NA"},{"$f":"IF(CCA_Form_A_Part_I!AM47=0,\"NA\",CCA_Form_A_Part_I!AM47)","v":"NA"},{"$f":"IF(CCA_Form_A_Part_I!AS47=0,\"NA\",CCA_Form_A_Part_I!AS47)","v":"NA"},{"$f":"IF(CCA_Form_A_Part_I!AY47=0,\"NA\",CCA_Form_A_Part_I!AY47)","v":"NA"},{"$f":"IF(CCA_Form_A_Part_I!BE47=0,\"NA\",CCA_Form_A_Part_I!BE47)","v":"NA"},0]
[{"$f":"IF(ISBLANK(Sheet1!A59),\" \",Sheet1!A59)","v":40},{"$f":"IF(ISBLANK(Sheet1!B59),\" \",Sheet1!B59)","v":" "},{"$f":"IF(ISBLANK(Sheet1!C59),\" \",Sheet1!C59)","v":" "},{"$f":"IF(CCA_Form_A_Part_I!I48=0,\"NA\",CCA_Form_A_Part_I!I48)","v":"NA"},{"$f":"IF(CCA_Form_A_Part_I!O48=0,\"NA\",CCA_Form_A_Part_I!O48)","v":"NA"},{"$f":"IF(CCA_Form_A_Part_I!U48=0,\"NA\",CCA_Form_A_Part_I!U48)","v":"NA"},{"$f":"IF(CCA_Form_A_Part_I!AA48=0,\"NA\",CCA_Form_A_Part_I!AA48)","v":"NA"},{"$f":"IF(CCA_Form_A_Part_I!AG48=0,\"NA\",CCA_Form_A_Part_I!AG48)","v":"NA"},{"$f":"IF(CCA_Form_A_Part_I!AM48=0,\"NA\",CCA_Form_A_Part_I!AM48)","v":"NA"},{"$f":"IF(CCA_Form_A_Part_I!AS48=0,\"NA\",CCA_Form_A_Part_I!AS48)","v":"NA"},{"$f":"IF(CCA_Form_A_Part_I!AY48=0,\"NA\",CCA_Form_A_Part_I!AY48)","v":"NA"},{"$f":"IF(CCA_Form_A_Part_I!BE48=0,\"NA\",CCA_Form_A_Part_I!BE48)","v":"NA"},0]
[{"$f":"IF(ISBLANK(Sheet1!A60),\" \",Sheet1!A60)","v":41},{"$f":"IF(ISBLANK(Sheet1!B60),\" \",Sheet1!B60)","v":" "},{"$f":"IF(ISBLANK(Sheet1!C60),\" \",Sheet1!C60)","v":" "},{"$f":"IF(CCA_Form_A_Part_I!I49=0,\"NA\",CCA_Form_A_Part_I!I49)","v":"NA"},{"$f":"IF(CCA_Form_A_Part_I!O49=0,\"NA\",CCA_Form_A_Part_I!O49)","v":"NA"},{"$f":"IF(CCA_Form_A_Part_I!U49=0,\"NA\",CCA_Form_A_Part_I!U49)","v":"NA"},{"$f":"IF(CCA_Form_A_Part_I!AA49=0,\"NA\",CCA_Form_A_Part_I!AA49)","v":"NA"},{"$f":"IF(CCA_Form_A_Part_I!AG49=0,\"NA\",CCA_Form_A_Part_I!AG49)","v":"NA"},{"$f":"IF(CCA_Form_A_Part_I!AM49=0,\"NA\",CCA_Form_A_Part_I!AM49)","v":"NA"},{"$f":"IF(CCA_Form_A_Part_I!AS49=0,\"NA\",CCA_Form_A_Part_I!AS49)","v":"NA"},{"$f":"IF(CCA_Form_A_Part_I!AY49=0,\"NA\",CCA_Form_A_Part_I!AY49)","v":"NA"},{"$f":"IF(CCA_Form_A_Part_I!BE49=0,\"NA\",CCA_Form_A_Part_I!BE49)","v":"NA"},0]
[{"$f":"IF(ISBLANK(Sheet1!A61),\" \",Sheet1!A61)","v":42},{"$f":"IF(ISBLANK(Sheet1!B61),\" \",Sheet1!B61)","v":" "},{"$f":"IF(ISBLANK(Sheet1!C61),\" \",Sheet1!C61)","v":" "},{"$f":"IF(CCA_Form_A_Part_I!I50=0,\"NA\",CCA_Form_A_Part_I!I50)","v":"NA"},{"$f":"IF(CCA_Form_A_Part_I!O50=0,\"NA\",CCA_Form_A_Part_I!O50)","v":"NA"},{"$f":"IF(CCA_Form_A_Part_I!U50=0,\"NA\",CCA_Form_A_Part_I!U50)","v":"NA"},{"$f":"IF(CCA_Form_A_Part_I!AA50=0,\"NA\",CCA_Form_A_Part_I!AA50)","v":"NA"},{"$f":"IF(CCA_Form_A_Part_I!AG50=0,\"NA\",CCA_Form_A_Part_I!AG50)","v":"NA"},{"$f":"IF(CCA_Form_A_Part_I!AM50=0,\"NA\",CCA_Form_A_Part_I!AM50)","v":"NA"},{"$f":"IF(CCA_Form_A_Part_I!AS50=0,\"NA\",CCA_Form_A_Part_I!AS50)","v":"NA"},{"$f":"IF(CCA_Form_A_Part_I!AY50=0,\"NA\",CCA_Form_A_Part_I!AY50)","v":"NA"},{"$f":"IF(CCA_Form_A_Part_I!BE50=0,\"NA\",CCA_Form_A_Part_I!BE50)","v":"NA"},0]
[{"$f":"IF(ISBLANK(Sheet1!A62),\" \",Sheet1!A62)","v":43},{"$f":"IF(ISBLANK(Sheet1!B62),\" \",Sheet1!B62)","v":" "},{"$f":"IF(ISBLANK(Sheet1!C62),\" \",Sheet1!C62)","v":" "},{"$f":"IF(CCA_Form_A_Part_I!I51=0,\"NA\",CCA_Form_A_Part_I!I51)","v":"NA"},{"$f":"IF(CCA_Form_A_Part_I!O51=0,\"NA\",CCA_Form_A_Part_I!O51)","v":"NA"},{"$f":"IF(CCA_Form_A_Part_I!U51=0,\"NA\",CCA_Form_A_Part_I!U51)","v":"NA"},{"$f":"IF(CCA_Form_A_Part_I!AA51=0,\"NA\",CCA_Form_A_Part_I!AA51)","v":"NA"},{"$f":"IF(CCA_Form_A_Part_I!AG51=0,\"NA\",CCA_Form_A_Part_I!AG51)","v":"NA"},{"$f":"IF(CCA_Form_A_Part_I!AM51=0,\"NA\",CCA_Form_A_Part_I!AM51)","v":"NA"},{"$f":"IF(CCA_Form_A_Part_I!AS51=0,\"NA\",CCA_Form_A_Part_I!AS51)","v":"NA"},{"$f":"IF(CCA_Form_A_Part_I!AY51=0,\"NA\",CCA_Form_A_Part_I!AY51)","v":"NA"},{"$f":"IF(CCA_Form_A_Part_I!BE51=0,\"NA\",CCA_Form_A_Part_I!BE51)","v":"NA"},0]
[{"$f":"IF(ISBLANK(Sheet1!A63),\" \",Sheet1!A63)","v":44},{"$f":"IF(ISBLANK(Sheet1!B63),\" \",Sheet1!B63)","v":" "},{"$f":"IF(ISBLANK(Sheet1!C63),\" \",Sheet1!C63)","v":" "},{"$f":"IF(CCA_Form_A_Part_I!I52=0,\"NA\",CCA_Form_A_Part_I!I52)","v":"NA"},{"$f":"IF(CCA_Form_A_Part_I!O52=0,\"NA\",CCA_Form_A_Part_I!O52)","v":"NA"},{"$f":"IF(CCA_Form_A_Part_I!U52=0,\"NA\",CCA_Form_A_Part_I!U52)","v":"NA"},{"$f":"IF(CCA_Form_A_Part_I!AA52=0,\"NA\",CCA_Form_A_Part_I!AA52)","v":"NA"},{"$f":"IF(CCA_Form_A_Part_I!AG52=0,\"NA\",CCA_Form_A_Part_I!AG52)","v":"NA"},{"$f":"IF(CCA_Form_A_Part_I!AM52=0,\"NA\",CCA_Form_A_Part_I!AM52)","v":"NA"},{"$f":"IF(CCA_Form_A_Part_I!AS52=0,\"NA\",CCA_Form_A_Part_I!AS52)","v":"NA"},{"$f":"IF(CCA_Form_A_Part_I!AY52=0,\"NA\",CCA_Form_A_Part_I!AY52)","v":"NA"},{"$f":"IF(CCA_Form_A_Part_I!BE52=0,\"NA\",CCA_Form_A_Part_I!BE52)","v":"NA"},0]
[{"$f":"IF(ISBLANK(Sheet1!A64),\" \",Sheet1!A64)","v":45},{"$f":"IF(ISBLANK(Sheet1!B64),\" \",Sheet1!B64)","v":" "},{"$f":"IF(ISBLANK(Sheet1!C64),\" \",Sheet1!C64)","v":" "},{"$f":"IF(CCA_Form_A_Part_I!I53=0,\"NA\",CCA_Form_A_Part_I!I53)","v":"NA"},{"$f":"IF(CCA_Form_A_Part_I!O53=0,\"NA\",CCA_Form_A_Part_I!O53)","v":"NA"},{"$f":"IF(CCA_Form_A_Part_I!U53=0,\"NA\",CCA_Form_A_Part_I!U53)","v":"NA"},{"$f":"IF(CCA_Form_A_Part_I!AA53=0,\"NA\",CCA_Form_A_Part_I!AA53)","v":"NA"},{"$f":"IF(CCA_Form_A_Part_I!AG53=0,\"NA\",CCA_Form_A_Part_I!AG53)","v":"NA"},{"$f":"IF(CCA_Form_A_Part_I!AM53=0,\"NA\",CCA_Form_A_Part_I!AM53)","v":"NA"},{"$f":"IF(CCA_Form_A_Part_I!AS53=0,\"NA\",CCA_Form_A_Part_I!AS53)","v":"NA"},{"$f":"IF(CCA_Form_A_Part_I!AY53=0,\"NA\",CCA_Form_A_Part_I!AY53)","v":"NA"},{"$f":"IF(CCA_Form_A_Part_I!BE53=0,\"NA\",CCA_Form_A_Part_I!BE53)","v":"NA"},0]
[{"$f":"IF(ISBLANK(Sheet1!A65),\" \",Sheet1!A65)","v":46},{"$f":"IF(ISBLANK(Sheet1!B65),\" \",Sheet1!B65)","v":" "},{"$f":"IF(ISBLANK(Sheet1!C65),\" \",Sheet1!C65)","v":" "},{"$f":"IF(CCA_Form_A_Part_I!I54=0,\"NA\",CCA_Form_A_Part_I!I54)","v":"NA"},{"$f":"IF(CCA_Form_A_Part_I!O54=0,\"NA\",CCA_Form_A_Part_I!O54)","v":"NA"},{"$f":"IF(CCA_Form_A_Part_I!U54=0,\"NA\",CCA_Form_A_Part_I!U54)","v":"NA"},{"$f":"IF(CCA_Form_A_Part_I!AA54=0,\"NA\",CCA_Form_A_Part_I!AA54)","v":"NA"},{"$f":"IF(CCA_Form_A_Part_I!AG54=0,\"NA\",CCA_Form_A_Part_I!AG54)","v":"NA"},{"$f":"IF(CCA_Form_A_Part_I!AM54=0,\"NA\",CCA_Form_A_Part_I!AM54)","v":"NA"},{"$f":"IF(CCA_Form_A_Part_I!AS54=0,\"NA\",CCA_Form_A_Part_I!AS54)","v":"NA"},{"$f":"IF(CCA_Form_A_Part_I!AY54=0,\"NA\",CCA_Form_A_Part_I!AY54)","v":"NA"},{"$f":"IF(CCA_Form_A_Part_I!BE54=0,\"NA\",CCA_Form_A_Part_I!BE54)","v":"NA"},0]
[{"$f":"IF(ISBLANK(Sheet1!A66),\" \",Sheet1!A66)","v":47},{"$f":"IF(ISBLANK(Sheet1!B66),\" \",Sheet1!B66)","v":" "},{"$f":"IF(ISBLANK(Sheet1!C66),\" \",Sheet1!C66)","v":" "},{"$f":"IF(CCA_Form_A_Part_I!I55=0,\"NA\",CCA_Form_A_Part_I!I55)","v":"NA"},{"$f":"IF(CCA_Form_A_Part_I!O55=0,\"NA\",CCA_Form_A_Part_I!O55)","v":"NA"},{"$f":"IF(CCA_Form_A_Part_I!U55=0,\"NA\",CCA_Form_A_Part_I!U55)","v":"NA"},{"$f":"IF(CCA_Form_A_Part_I!AA55=0,\"NA\",CCA_Form_A_Part_I!AA55)","v":"NA"},{"$f":"IF(CCA_Form_A_Part_I!AG55=0,\"NA\",CCA_Form_A_Part_I!AG55)","v":"NA"},{"$f":"IF(CCA_Form_A_Part_I!AM55=0,\"NA\",CCA_Form_A_Part_I!AM55)","v":"NA"},{"$f":"IF(CCA_Form_A_Part_I!AS55=0,\"NA\",CCA_Form_A_Part_I!AS55)","v":"NA"},{"$f":"IF(CCA_Form_A_Part_I!AY55=0,\"NA\",CCA_Form_A_Part_I!AY55)","v":"NA"},{"$f":"IF(CCA_Form_A_Part_I!BE55=0,\"NA\",CCA_Form_A_Part_I!BE55)","v":"NA"},0]
[{"$f":"IF(ISBLANK(Sheet1!A67),\" \",Sheet1!A67)","v":48},{"$f":"IF(ISBLANK(Sheet1!B67),\" \",Sheet1!B67)","v":" "},{"$f":"IF(ISBLANK(Sheet1!C67),\" \",Sheet1!C67)","v":" "},{"$f":"IF(CCA_Form_A_Part_I!I56=0,\"NA\",CCA_Form_A_Part_I!I56)","v":"NA"},{"$f":"IF(CCA_Form_A_Part_I!O56=0,\"NA\",CCA_Form_A_Part_I!O56)","v":"NA"},{"$f":"IF(CCA_Form_A_Part_I!U56=0,\"NA\",CCA_Form_A_Part_I!U56)","v":"NA"},{"$f":"IF(CCA_Form_A_Part_I!AA56=0,\"NA\",CCA_Form_A_Part_I!AA56)","v":"NA"},{"$f":"IF(CCA_Form_A_Part_I!AG56=0,\"NA\",CCA_Form_A_Part_I!AG56)","v":"NA"},{"$f":"IF(CCA_Form_A_Part_I!AM56=0,\"NA\",CCA_Form_A_Part_I!AM56)","v":"NA"},{"$f":"IF(CCA_Form_A_Part_I!AS56=0,\"NA\",CCA_Form_A_Part_I!AS56)","v":"NA"},{"$f":"IF(CCA_Form_A_Part_I!AY56=0,\"NA\",CCA_Form_A_Part_I!AY56)","v":"NA"},{"$f":"IF(CCA_Form_A_Part_I!BE56=0,\"NA\",CCA_Form_A_Part_I!BE56)","v":"NA"},{"$f":"SUM(D58:L58)","v":0}]
[{"$f":"IF(ISBLANK(Sheet1!A68),\" \",Sheet1!A68)","v":49},{"$f":"IF(ISBLANK(Sheet1!B68),\" \",Sheet1!B68)","v":" "},{"$f":"IF(ISBLANK(Sheet1!C68),\" \",Sheet1!C68)","v":" "},{"$f":"IF(CCA_Form_A_Part_I!I57=0,\"NA\",CCA_Form_A_Part_I!I57)","v":"NA"},{"$f":"IF(CCA_Form_A_Part_I!O57=0,\"NA\",CCA_Form_A_Part_I!O57)","v":"NA"},{"$f":"IF(CCA_Form_A_Part_I!U57=0,\"NA\",CCA_Form_A_Part_I!U57)","v":"NA"},{"$f":"IF(CCA_Form_A_Part_I!AA57=0,\"NA\",CCA_Form_A_Part_I!AA57)","v":"NA"},{"$f":"IF(CCA_Form_A_Part_I!AG57=0,\"NA\",CCA_Form_A_Part_I!AG57)","v":"NA"},{"$f":"IF(CCA_Form_A_Part_I!AM57=0,\"NA\",CCA_Form_A_Part_I!AM57)","v":"NA"},{"$f":"IF(CCA_Form_A_Part_I!AS57=0,\"NA\",CCA_Form_A_Part_I!AS57)","v":"NA"},{"$f":"IF(CCA_Form_A_Part_I!AY57=0,\"NA\",CCA_Form_A_Part_I!AY57)","v":"NA"},{"$f":"IF(CCA_Form_A_Part_I!BE57=0,\"NA\",CCA_Form_A_Part_I!BE57)","v":"NA"},0]
[{"$f":"IF(ISBLANK(Sheet1!A69),\" \",Sheet1!A69)","v":50},{"$f":"IF(ISBLANK(Sheet1!B69),\" \",Sheet1!B69)","v":" "},{"$f":"IF(ISBLANK(Sheet1!C69),\" \",Sheet1!C69)","v":" "},{"$f":"IF(CCA_Form_A_Part_I!I58=0,\"NA\",CCA_Form_A_Part_I!I58)","v":"NA"},{"$f":"IF(CCA_Form_A_Part_I!O58=0,\"NA\",CCA_Form_A_Part_I!O58)","v":"NA"},{"$f":"IF(CCA_Form_A_Part_I!U58=0,\"NA\",CCA_Form_A_Part_I!U58)","v":"NA"},{"$f":"IF(CCA_Form_A_Part_I!AA58=0,\"NA\",CCA_Form_A_Part_I!AA58)","v":"NA"},{"$f":"IF(CCA_Form_A_Part_I!AG58=0,\"NA\",CCA_Form_A_Part_I!AG58)","v":"NA"},{"$f":"IF(CCA_Form_A_Part_I!AM58=0,\"NA\",CCA_Form_A_Part_I!AM58)","v":"NA"},{"$f":"IF(CCA_Form_A_Part_I!AS58=0,\"NA\",CCA_Form_A_Part_I!AS58)","v":"NA"},{"$f":"IF(CCA_Form_A_Part_I!AY58=0,\"NA\",CCA_Form_A_Part_I!AY58)","v":"NA"},{"$f":"IF(CCA_Form_A_Part_I!BE58=0,\"NA\",CCA_Form_A_Part_I!BE58)","v":"NA"},0]
[{"$f":"IF(ISBLANK(Sheet1!A70),\" \",Sheet1!A70)","v":51},{"$f":"IF(ISBLANK(Sheet1!B70),\" \",Sheet1!B70)","v":" "},{"$f":"IF(ISBLANK(Sheet1!C70),\" \",Sheet1!C70)","v":" "},{"$f":"IF(CCA_Form_A_Part_I!I59=0,\"NA\",CCA_Form_A_Part_I!I59)","v":"NA"},{"$f":"IF(CCA_Form_A_Part_I!O59=0,\"NA\",CCA_Form_A_Part_I!O59)","v":"NA"},{"$f":"IF(CCA_Form_A_Part_I!U59=0,\"NA\",CCA_Form_A_Part_I!U59)","v":"NA"},{"$f":"IF(CCA_Form_A_Part_I!AA59=0,\"NA\",CCA_Form_A_Part_I!AA59)","v":"NA"},{"$f":"IF(CCA_Form_A_Part_I!AG59=0,\"NA\",CCA_Form_A_Part_I!AG59)","v":"NA"},{"$f":"IF(CCA_Form_A_Part_I!AM59=0,\"NA\",CCA_Form_A_Part_I!AM59)","v":"NA"},{"$f":"IF(CCA_Form_A_Part_I!AS59=0,\"NA\",CCA_Form_A_Part_I!AS59)","v":"NA"},{"$f":"IF(CCA_Form_A_Part_I!AY59=0,\"NA\",CCA_Form_A_Part_I!AY59)","v":"NA"},{"$f":"IF(CCA_Form_A_Part_I!BE59=0,\"NA\",CCA_Form_A_Part_I!BE59)","v":"NA"},0]
[{"$f":"IF(ISBLANK(Sheet1!A71),\" \",Sheet1!A71)","v":52},{"$f":"IF(ISBLANK(Sheet1!B71),\" \",Sheet1!B71)","v":" "},{"$f":"IF(ISBLANK(Sheet1!C71),\" \",Sheet1!C71)","v":" "},{"$f":"IF(CCA_Form_A_Part_I!I60=0,\"NA\",CCA_Form_A_Part_I!I60)","v":"NA"},{"$f":"IF(CCA_Form_A_Part_I!O60=0,\"NA\",CCA_Form_A_Part_I!O60)","v":"NA"},{"$f":"IF(CCA_Form_A_Part_I!U60=0,\"NA\",CCA_Form_A_Part_I!U60)","v":"NA"},{"$f":"IF(CCA_Form_A_Part_I!AA60=0,\"NA\",CCA_Form_A_Part_I!AA60)","v":"NA"},{"$f":"IF(CCA_Form_A_Part_I!AG60=0,\"NA\",CCA_Form_A_Part_I!AG60)","v":"NA"},{"$f":"IF(CCA_Form_A_Part_I!AM60=0,\"NA\",CCA_Form_A_Part_I!AM60)","v":"NA"},{"$f":"IF(CCA_Form_A_Part_I!AS60=0,\"NA\",CCA_Form_A_Part_I!AS60)","v":"NA"},{"$f":"IF(CCA_Form_A_Part_I!AY60=0,\"NA\",CCA_Form_A_Part_I!AY60)","v":"NA"},{"$f":"IF(CCA_Form_A_Part_I!BE60=0,\"NA\",CCA_Form_A_Part_I!BE60)","v":"NA"},0]
[{"$f":"IF(ISBLANK(Sheet1!A72),\" \",Sheet1!A72)","v":53},{"$f":"IF(ISBLANK(Sheet1!B72),\" \",Sheet1!B72)","v":" "},{"$f":"IF(ISBLANK(Sheet1!C72),\" \",Sheet1!C72)","v":" "},{"$f":"IF(CCA_Form_A_Part_I!I61=0,\"NA\",CCA_Form_A_Part_I!I61)","v":"NA"},{"$f":"IF(CCA_Form_A_Part_I!O61=0,\"NA\",CCA_Form_A_Part_I!O61)","v":"NA"},{"$f":"IF(CCA_Form_A_Part_I!U61=0,\"NA\",CCA_Form_A_Part_I!U61)","v":"NA"},{"$f":"IF(CCA_Form_A_Part_I!AA61=0,\"NA\",CCA_Form_A_Part_I!AA61)","v":"NA"},{"$f":"IF(CCA_Form_A_Part_I!AG61=0,\"NA\",CCA_Form_A_Part_I!AG61)","v":"NA"},{"$f":"IF(CCA_Form_A_Part_I!AM61=0,\"NA\",CCA_Form_A_Part_I!AM61)","v":"NA"},{"$f":"IF(CCA_Form_A_Part_I!AS61=0,\"NA\",CCA_Form_A_Part_I!AS61)","v":"NA"},{"$f":"IF(CCA_Form_A_Part_I!AY61=0,\"NA\",CCA_Form_A_Part_I!AY61)","v":"NA"},{"$f":"IF(CCA_Form_A_Part_I!BE61=0,\"NA\",CCA_Form_A_Part_I!BE61)","v":"NA"},0]
[{"$f":"IF(ISBLANK(Sheet1!A73),\" \",Sheet1!A73)","v":54},{"$f":"IF(ISBLANK(Sheet1!B73),\" \",Sheet1!B73)","v":" "},{"$f":"IF(ISBLANK(Sheet1!C73),\" \",Sheet1!C73)","v":" "},{"$f":"IF(CCA_Form_A_Part_I!I62=0,\"NA\",CCA_Form_A_Part_I!I62)","v":"NA"},{"$f":"IF(CCA_Form_A_Part_I!O62=0,\"NA\",CCA_Form_A_Part_I!O62)","v":"NA"},{"$f":"IF(CCA_Form_A_Part_I!U62=0,\"NA\",CCA_Form_A_Part_I!U62)","v":"NA"},{"$f":"IF(CCA_Form_A_Part_I!AA62=0,\"NA\",CCA_Form_A_Part_I!AA62)","v":"NA"},{"$f":"IF(CCA_Form_A_Part_I!AG62=0,\"NA\",CCA_Form_A_Part_I!AG62)","v":"NA"},{"$f":"IF(CCA_Form_A_Part_I!AM62=0,\"NA\",CCA_Form_A_Part_I!AM62)","v":"NA"},{"$f":"IF(CCA_Form_A_Part_I!AS62=0,\"NA\",CCA_Form_A_Part_I!AS62)","v":"NA"},{"$f":"IF(CCA_Form_A_Part_I!AY62=0,\"NA\",CCA_Form_A_Part_I!AY62)","v":"NA"},{"$f":"IF(CCA_Form_A_Part_I!BE62=0,\"NA\",CCA_Form_A_Part_I!BE62)","v":"NA"},0]
[{"$f":"IF(ISBLANK(Sheet1!A74),\" \",Sheet1!A74)","v":55},{"$f":"IF(ISBLANK(Sheet1!B74),\" \",Sheet1!B74)","v":" "},{"$f":"IF(ISBLANK(Sheet1!C74),\" \",Sheet1!C74)","v":" "},{"$f":"IF(CCA_Form_A_Part_I!I63=0,\"NA\",CCA_Form_A_Part_I!I63)","v":"NA"},{"$f":"IF(CCA_Form_A_Part_I!O63=0,\"NA\",CCA_Form_A_Part_I!O63)","v":"NA"},{"$f":"IF(CCA_Form_A_Part_I!U63=0,\"NA\",CCA_Form_A_Part_I!U63)","v":"NA"},{"$f":"IF(CCA_Form_A_Part_I!AA63=0,\"NA\",CCA_Form_A_Part_I!AA63)","v":"NA"},{"$f":"IF(CCA_Form_A_Part_I!AG63=0,\"NA\",CCA_Form_A_Part_I!AG63)","v":"NA"},{"$f":"IF(CCA_Form_A_Part_I!AM63=0,\"NA\",CCA_Form_A_Part_I!AM63)","v":"NA"},{"$f":"IF(CCA_Form_A_Part_I!AS63=0,\"NA\",CCA_Form_A_Part_I!AS63)","v":"NA"},{"$f":"IF(CCA_Form_A_Part_I!AY63=0,\"NA\",CCA_Form_A_Part_I!AY63)","v":"NA"},{"$f":"IF(CCA_Form_A_Part_I!BE63=0,\"NA\",CCA_Form_A_Part_I!BE63)","v":"NA"},0]
[{"$f":"IF(ISBLANK(Sheet1!A75),\" \",Sheet1!A75)","v":56},{"$f":"IF(ISBLANK(Sheet1!B75),\" \",Sheet1!B75)","v":" "},{"$f":"IF(ISBLANK(Sheet1!C75),\" \",Sheet1!C75)","v":" "},{"$f":"IF(CCA_Form_A_Part_I!I64=0,\"NA\",CCA_Form_A_Part_I!I64)","v":"NA"},{"$f":"IF(CCA_Form_A_Part_I!O64=0,\"NA\",CCA_Form_A_Part_I!O64)","v":"NA"},{"$f":"IF(CCA_Form_A_Part_I!U64=0,\"NA\",CCA_Form_A_Part_I!U64)","v":"NA"},{"$f":"IF(CCA_Form_A_Part_I!AA64=0,\"NA\",CCA_Form_A_Part_I!AA64)","v":"NA"},{"$f":"IF(CCA_Form_A_Part_I!AG64=0,\"NA\",CCA_Form_A_Part_I!AG64)","v":"NA"},{"$f":"IF(CCA_Form_A_Part_I!AM64=0,\"NA\",CCA_Form_A_Part_I!AM64)","v":"NA"},{"$f":"IF(CCA_Form_A_Part_I!AS64=0,\"NA\",CCA_Form_A_Part_I!AS64)","v":"NA"},{"$f":"IF(CCA_Form_A_Part_I!AY64=0,\"NA\",CCA_Form_A_Part_I!AY64)","v":"NA"},{"$f":"IF(CCA_Form_A_Part_I!BE64=0,\"NA\",CCA_Form_A_Part_I!BE64)","v":"NA"},0]
[{"$f":"IF(ISBLANK(Sheet1!A76),\" \",Sheet1!A76)","v":57},{"$f":"IF(ISBLANK(Sheet1!B76),\" \",Sheet1!B76)","v":" "},{"$f":"IF(ISBLANK(Sheet1!C76),\" \",Sheet1!C76)","v":" "},{"$f":"IF(CCA_Form_A_Part_I!I65=0,\"NA\",CCA_Form_A_Part_I!I65)","v":"NA"},{"$f":"IF(CCA_Form_A_Part_I!O65=0,\"NA\",CCA_Form_A_Part_I!O65)","v":"NA"},{"$f":"IF(CCA_Form_A_Part_I!U65=0,\"NA\",CCA_Form_A_Part_I!U65)","v":"NA"},{"$f":"IF(CCA_Form_A_Part_I!AA65=0,\"NA\",CCA_Form_A_Part_I!AA65)","v":"NA"},{"$f":"IF(CCA_Form_A_Part_I!AG65=0,\"NA\",CCA_Form_A_Part_I!AG65)","v":"NA"},{"$f":"IF(CCA_Form_A_Part_I!AM65=0,\"NA\",CCA_Form_A_Part_I!AM65)","v":"NA"},{"$f":"IF(CCA_Form_A_Part_I!AS65=0,\"NA\",CCA_Form_A_Part_I!AS65)","v":"NA"},{"$f":"IF(CCA_Form_A_Part_I!AY65=0,\"NA\",CCA_Form_A_Part_I!AY65)","v":"NA"},{"$f":"IF(CCA_Form_A_Part_I!BE65=0,\"NA\",CCA_Form_A_Part_I!BE65)","v":"NA"},0]
[{"$f":"IF(ISBLANK(Sheet1!A77),\" \",Sheet1!A77)","v":58},{"$f":"IF(ISBLANK(Sheet1!B77),\" \",Sheet1!B77)","v":" "},{"$f":"IF(ISBLANK(Sheet1!C77),\" \",Sheet1!C77)","v":" "},{"$f":"IF(CCA_Form_A_Part_I!I66=0,\"NA\",CCA_Form_A_Part_I!I66)","v":"NA"},{"$f":"IF(CCA_Form_A_Part_I!O66=0,\"NA\",CCA_Form_A_Part_I!O66)","v":"NA"},{"$f":"IF(CCA_Form_A_Part_I!U66=0,\"NA\",CCA_Form_A_Part_I!U66)","v":"NA"},{"$f":"IF(CCA_Form_A_Part_I!AA66=0,\"NA\",CCA_Form_A_Part_I!AA66)","v":"NA"},{"$f":"IF(CCA_Form_A_Part_I!AG66=0,\"NA\",CCA_Form_A_Part_I!AG66)","v":"NA"},{"$f":"IF(CCA_Form_A_Part_I!AM66=0,\"NA\",CCA_Form_A_Part_I!AM66)","v":"NA"},{"$f":"IF(CCA_Form_A_Part_I!AS66=0,\"NA\",CCA_Form_A_Part_I!AS66)","v":"NA"},{"$f":"IF(CCA_Form_A_Part_I!AY66=0,\"NA\",CCA_Form_A_Part_I!AY66)","v":"NA"},{"$f":"IF(CCA_Form_A_Part_I!BE66=0,\"NA\",CCA_Form_A_Part_I!BE66)","v":"NA"},{"$f":"SUM(D68:L68)","v":0}]
[{"$f":"IF(ISBLANK(Sheet1!A78),\" \",Sheet1!A78)","v":59},{"$f":"IF(ISBLANK(Sheet1!B78),\" \",Sheet1!B78)","v":" "},{"$f":"IF(ISBLANK(Sheet1!C78),\" \",Sheet1!C78)","v":" "},{"$f":"IF(CCA_Form_A_Part_I!I67=0,\"NA\",CCA_Form_A_Part_I!I67)","v":"NA"},{"$f":"IF(CCA_Form_A_Part_I!O67=0,\"NA\",CCA_Form_A_Part_I!O67)","v":"NA"},{"$f":"IF(CCA_Form_A_Part_I!U67=0,\"NA\",CCA_Form_A_Part_I!U67)","v":"NA"},{"$f":"IF(CCA_Form_A_Part_I!AA67=0,\"NA\",CCA_Form_A_Part_I!AA67)","v":"NA"},{"$f":"IF(CCA_Form_A_Part_I!AG67=0,\"NA\",CCA_Form_A_Part_I!AG67)","v":"NA"},{"$f":"IF(CCA_Form_A_Part_I!AM67=0,\"NA\",CCA_Form_A_Part_I!AM67)","v":"NA"},{"$f":"IF(CCA_Form_A_Part_I!AS67=0,\"NA\",CCA_Form_A_Part_I!AS67)","v":"NA"},{"$f":"IF(CCA_Form_A_Part_I!AY67=0,\"NA\",CCA_Form_A_Part_I!AY67)","v":"NA"},{"$f":"IF(CCA_Form_A_Part_I!BE67=0,\"NA\",CCA_Form_A_Part_I!BE67)","v":"NA"},0]
[{"$f":"IF(ISBLANK(Sheet1!A79),\" \",Sheet1!A79)","v":60},{"$f":"IF(ISBLANK(Sheet1!B79),\" \",Sheet1!B79)","v":" "},{"$f":"IF(ISBLANK(Sheet1!C79),\" \",Sheet1!C79)","v":" "},{"$f":"IF(CCA_Form_A_Part_I!I68=0,\"NA\",CCA_Form_A_Part_I!I68)","v":"NA"},{"$f":"IF(CCA_Form_A_Part_I!O68=0,\"NA\",CCA_Form_A_Part_I!O68)","v":"NA"},{"$f":"IF(CCA_Form_A_Part_I!U68=0,\"NA\",CCA_Form_A_Part_I!U68)","v":"NA"},{"$f":"IF(CCA_Form_A_Part_I!AA68=0,\"NA\",CCA_Form_A_Part_I!AA68)","v":"NA"},{"$f":"IF(CCA_Form_A_Part_I!AG68=0,\"NA\",CCA_Form_A_Part_I!AG68)","v":"NA"},{"$f":"IF(CCA_Form_A_Part_I!AM68=0,\"NA\",CCA_Form_A_Part_I!AM68)","v":"NA"},{"$f":"IF(CCA_Form_A_Part_I!AS68=0,\"NA\",CCA_Form_A_Part_I!AS68)","v":"NA"},{"$f":"IF(CCA_Form_A_Part_I!AY68=0,\"NA\",CCA_Form_A_Part_I!AY68)","v":"NA"},{"$f":"IF(CCA_Form_A_Part_I!BE68=0,\"NA\",CCA_Form_A_Part_I!BE68)","v":"NA"},0]
[]
["Certified that,"]
["(1) The entries are verified with the records and there is no error or omission."]
["(2) These assessments were published and no grievances are pending."]
["(3) No error(s) is/are shown in the CCA Form A Part I and CCA Form A Part II."]
[]
[]
[]
["Course Faculty/Course Coordinator",null,null,"HoD",{"$nulls":3},"Principal"]

{"sheet":"CCA Form A Part II (1)","index":3,"n_rows":54,"n_cols":8,"rows_kept":54,"hidden":true,"merged":[[0,0,0,9],[1,1,1,2],[2,1,2,2],[2,4,2,5],[2,6,2,8],[3,1,3,2],[3,4,3,5],[3,6,3,8],[4,0,4,1],[4,6,4,9],[5,2,6,2],[46,0,46,3],[47,0,47,3],[48,0,48,3],[53,0,53,2],[53,3,53,4],[53,7,53,9]]}
["ST. JOSEPH'S COLLEGE, MOOLAMATTOM (AUTONOMOUS)"]
["Academic Year",{"$f":"Sheet1!D2","v":"2024-2025"}]
["Course Code:",{"$f":"Sheet1!D3","v":"MG1DSCMA101"},null,null,"Name of the Course:",null,{"$f":"Sheet1!D6","v":"INTRODUCTION TO WEB DESIGNING\t\t"}]
["Semester:",{"$f":"Sheet1!D4","v":1},null,null,"Number of Course Outcomes:",null,{"$f":"Sheet1!D7","v":9}]
["CCA Component Type (Theory/Practical):",null,{"$f":"Sheet1!D5","v":"THEORY"}]
["CO Number","CO 1","Total Marks Allocated for CCA"]
["Evaluation Method(s) Used",{"$f":"Sheet1!A11&CHAR(10)&Sheet1!A12&CHAR(10)&Sheet1!A13&CHAR(10)&Sheet1!A14&CHAR(10)&Sheet1!A15","v":"\n\n\n\n"}]
["Maximum Marks Allocated",{"$f":"Sheet1!C16","v":0},{"$f":"Sheet1!D8","v":0}]
["SL. No.","Register Number","Name of the Student","Marks Obtained in CO 1","Total Marks Obtained in CCA"]
[{"$f":"IF(ISBLANK(Sheet1!A20),\" \",Sheet1!A20)","v":1},{"$f":"IF(ISBLANK(Sheet1!B20),\" \",Sheet1!B20)","v":" "},{"$f":"IF(ISBLANK(Sheet1!C20),\" \",Sheet1!C20)","v":" "},{"$f":"IF(CCA_Form_A_Part_I!I9=0,\" \",CCA_Form_A_Part_I!I9)","v":" "},{"$f":"SUM(D10)","v":{"v":0,"d":"0.00"}}]
[{"$f":"IF(ISBLANK(Sheet1!A21),\" \",Sheet1!A21)","v":2},{"$f":"IF(ISBLANK(Sheet1!B21),\" \",Sheet1!B21)","v":" "},{"$f":"IF(ISBLANK(Sheet1!C21),\" \",Sheet1!C21)","v":" "},{"$f":"IF(CCA_Form_A_Part_I!I10=0,\" \",CCA_Form_A_Part_I!I10)","v":" "},{"$f":"SUM(D11)","v":{"v":0,"d":"0.00"}}]
[{"$f":"IF(ISBLANK(Sheet1!A22),\" \",Sheet1!A22)","v":3},{"$f":"IF(ISBLANK(Sheet1!B22),\" \",Sheet1!B22)","v":" "},{"$f":"IF(ISBLANK(Sheet1!C22),\" \",Sheet1!C22)","v":" "},{"$f":"IF(CCA_Form_A_Part_I!I11=0,\" \",CCA_Form_A_Part_I!I11)","v":" "},{"v":0,"d":"0.00"}]
[{"$f":"IF(ISBLANK(Sheet1!A23),\" \",Sheet1!A23)","v":4},{"$f":"IF(ISBLANK(Sheet1!B23),\" \",Sheet1!B23)","v":" "},{"$f":"IF(ISBLANK(Sheet1!C23),\" \",Sheet1!C23)","v":" "},{"$f":"IF(CCA_Form_A_Part_I!I12=0,\" \",CCA_Form_A_Part_I!I12)","v":" "},{"v":0,"d":"0.00"}]
[{"$f":"IF(ISBLANK(Sheet1!A24),\" \",Sheet1!A24)","v":5},{"$f":"IF(ISBLANK(Sheet1!B24),\" \",Sheet1!B24)","v":" "},{"$f":"IF(ISBLANK(Sheet1!C24),\" \",Sheet1!C24)","v":" "},{"$f":"IF(CCA_Form_A_Part_I!I13=0,\" \",CCA_Form_A_Part_I!I13)","v":" "},{"v":0,"d":"0.00"}]
[{"$f":"IF(ISBLANK(Sheet1!A25),\" \",Sheet1!A25)","v":6},{"$f":"IF(ISBLANK(Sheet1!B25),\" \",Sheet1!B25)","v":" "},{"$f":"IF(ISBLANK(Sheet1!C25),\" \",Sheet1!C25)","v":" "},{"$f":"IF(CCA_Form_A_Part_I!I14=0,\" \",CCA_Form_A_Part_I!I14)","v":" "},{"v":0,"d":"0.00"}]
[{"$f":"IF(ISBLANK(Sheet1!A26),\" \",Sheet1!A26)","v":7},{"$f":"IF(ISBLANK(Sheet1!B26),\" \",Sheet1!B26)","v":" "},{"$f":"IF(ISBLANK(Sheet1!C26),\" \",Sheet1!C26)","v":" "},{"$f":"IF(CCA_Form_A_Part_I!I15=0,\" \",CCA_Form_A_Part_I!I15)","v":" "},{"v":0,"d":"0.00"}]
[{"$f":"IF(ISBLANK(Sheet1!A27),\" \",Sheet1!A27)","v":8},{"$f":"IF(ISBLANK(Sheet1!B27),\" \",Sheet1!B27)","v":" "},{"$f":"IF(ISBLANK(Sheet1!C27),\" \",Sheet1!C27)","v":" "},{"$f":"IF(CCA_Form_A_Part_I!I16=0,\" \",CCA_Form_A_Part_I!I16)","v":" "},{"v":0,"d":"0.00"}]
[{"$f":"IF(ISBLANK(Sheet1!A28),\" \",Sheet1!A28)","v":9},{"$f":"IF(ISBLANK(Sheet1!B28),\" \",Sheet1!B28)","v":" "},{"$f":"IF(ISBLANK(Sheet1!C28),\" \",Sheet1!C28)","v":" "},{"$f":"IF(CCA_Form_A_Part_I!I17=0,\" \",CCA_Form_A_Part_I!I17)","v":" "},{"v":0,"d":"0.00"}]
[{"$f":"IF(ISBLANK(Sheet1!A29),\" \",Sheet1!A29)","v":10},{"$f":"IF(ISBLANK(Sheet1!B29),\" \",Sheet1!B29)","v":" "},{"$f":"IF(ISBLANK(Sheet1!C29),\" \",Sheet1!C29)","v":" "},{"$f":"IF(CCA_Form_A_Part_I!I18=0,\" \",CCA_Form_A_Part_I!I18)","v":" "},{"v":0,"d":"0.00"}]
[{"$f":"IF(ISBLANK(Sheet1!A30),\" \",Sheet1!A30)","v":11},{"$f":"IF(ISBLANK(Sheet1!B30),\" \",Sheet1!B30)","v":" "},{"$f":"IF(ISBLANK(Sheet1!C30),\" \",Sheet1!C30)","v":" "},{"$f":"IF(CCA_Form_A_Part_I!I19=0,\" \",CCA_Form_A_Part_I!I19)","v":" "},{"v":0,"d":"0.00"}]
[{"$f":"IF(ISBLANK(Sheet1!A31),\" \",Sheet1!A31)","v":12},{"$f":"IF(ISBLANK(Sheet1!B31),\" \",Sheet1!B31)","v":" "},{"$f":"IF(ISBLANK(Sheet1!C31),\" \",Sheet1!C31)","v":" "},{"$f":"IF(CCA_Form_A_Part_I!I20=0,\" \",CCA_Form_A_Part_I!I20)","v":" "},{"v":0,"d":"0.00"}]
[{"$f":"IF(ISBLANK(Sheet1!A32),\" \",Sheet1!A32)","v":13},{"$f":"IF(ISBLANK(Sheet1!B32),\" \",Sheet1!B32)","v":" "},{"$f":"IF(ISBLANK(Sheet1!C32),\" \",Sheet1!C32)","v":" "},{"$f":"IF(CCA_Form_A_Part_I!I21=0,\" \",CCA_Form_A_Part_I!I21)","v":" "},{"v":0,"d":"0.00"}]
[{"$f":"IF(ISBLANK(Sheet1!A33),\" \",Sheet1!A33)","v":14},{"$f":"IF(ISBLANK(Sheet1!B33),\" \",Sheet1!B33)","v":" "},{"$f":"IF(ISBLANK(Sheet1!C33),\" \",Sheet1!C33)","v":" "},{"$f":"IF(CCA_Form_A_Part_I!I22=0,\" \",CCA_Form_A_Part_I!I22)","v":" "},{"v":0,"d":"0.00"}]
[{"$f":"IF(ISBLANK(Sheet1!A34),\" \",Sheet1!A34)","v":15},{"$f":"IF(ISBLANK(Sheet1!B34),\" \",Sheet1!B34)","v":" "},{"$f":"IF(ISBLANK(Sheet1!C34),\" \",Sheet1!C34)","v":" "},{"$f":"IF(CCA_Form_A_Part_I!I23=0,\" \",CCA_Form_A_Part_I!I23)","v":" "},{"v":0,"d":"0.00"}]
[{"$f":"IF(ISBLANK(Sheet1!A35),\" \",Sheet1!A35)","v":16},{"$f":"IF(ISBLANK(Sheet1!B35),\" \",Sheet1!B35)","v":" "},{"$f":"IF(ISBLANK(Sheet1!C35),\" \",Sheet1!C35)","v":" "},{"$f":"IF(CCA_Form_A_Part_I!I24=0,\" \",CCA_Form_A_Part_I!I24)","v":" "},{"v":0,"d":"0.00"}]
[{"$f":"IF(ISBLANK(Sheet1!A36),\" \",Sheet1!A36)","v":17},{"$f":"IF(ISBLANK(Sheet1!B36),\" \",Sheet1!B36)","v":" "},{"$f":"IF(ISBLANK(Sheet1!C36),\" \",Sheet1!C36)","v":" "},{"$f":"IF(CCA_Form_A_Part_I!I25=0,\" \",CCA_Form_A_Part_I!I25)","v":" "},{"v":0,"d":"0.00"}]
[{"$f":"IF(ISBLANK(Sheet1!A37),\" \",Sheet1!A37)","v":18},{"$f":"IF(ISBLANK(Sheet1!B37),\" \",Sheet1!B37)","v":" "},{"$f":"IF(ISBLANK(Sheet1!C37),\" \",Sheet1!C37)","v":" "},{"$f":"IF(CCA_Form_A_Part_I!I26=0,\" \",CCA_Form_A_Part_I!I26)","v":" "},{"v":0,"d":"0.00"}]
[{"$f":"IF(ISBLANK(Sheet1!A38),\" \",Sheet1!A38)","v":19},{"$f":"IF(ISBLANK(Sheet1!B38),\" \",Sheet1!B38)","v":" "},{"$f":"IF(ISBLANK(Sheet1!C38),\" \",Sheet1!C38)","v":" "},{"$f":"IF(CCA_Form_A_Part_I!I27=0,\" \",CCA_Form_A_Part_I!I27)","v":" "},{"v":0,"d":"0.00"}]
[{"$f":"IF(ISBLANK(Sheet1!A39),\" \",Sheet1!A39)","v":20},{"$f":"IF(ISBLANK(Sheet1!B39),\" \",Sheet1!B39)","v":" "},{"$f":"IF(ISBLANK(Sheet1!C39),\" \",Sheet1!C39)","v":" "},{"$f":"IF(CCA_Form_A_Part_I!I28=0,\" \",CCA_Form_A_Part_I!I28)","v":" "},{"v":0,"d":"0.00"}]
[{"$f":"IF(ISBLANK(Sheet1!A40),\" \",Sheet1!A40)","v":21},{"$f":"IF(ISBLANK(Sheet1!B40),\" \",Sheet1!B40)","v":" "},{"$f":"IF(ISBLANK(Sheet1!C40),\" \",Sheet1!C40)","v":" "},{"$f":"IF(CCA_Form_A_Part_I!I29=0,\" \",CCA_Form_A_Part_I!I29)","v":" "},{"v":0,"d":"0.00"}]
[{"$f":"IF(ISBLANK(Sheet1!A41),\" \",Sheet1!A41)","v":22},{"$f":"IF(ISBLANK(Sheet1!B41),\" \",Sheet1!B41)","v":" "},{"$f":"IF(ISBLANK(Sheet1!C41),\" \",Sheet1!C41)","v":" "},{"$f":"IF(CCA_Form_A_Part_I!I30=0,\" \",CCA_Form_A_Part_I!I30)","v":" "},{"v":0,"d":"0.00"}]
[{"$f":"IF(ISBLANK(Sheet1!A42),\" \",Sheet1!A42)","v":23},{"$f":"IF(ISBLANK(Sheet1!B42),\" \",Sheet1!B42)","v":" "},{"$f":"IF(ISBLANK(Sheet1!C42),\" \",Sheet1!C42)","v":" "},{"$f":"IF(CCA_Form_A_Part_I!I31=0,\" \",CCA_Form_A_Part_I!I31)","v":" "},{"v":0,"d":"0.00"}]
[{"$f":"IF(ISBLANK(Sheet1!A43),\" \",Sheet1!A43)","v":24},{"$f":"IF(ISBLANK(Sheet1!B43),\" \",Sheet1!B43)","v":" "},{"$f":"IF(ISBLANK(Sheet1!C43),\" \",Sheet1!C43)","v":" "},{"$f":"IF(CCA_Form_A_Part_I!I32=0,\" \",CCA_Form_A_Part_I!I32)","v":" "},{"v":0,"d":"0.00"}]
[{"$f":"IF(ISBLANK(Sheet1!A44),\" \",Sheet1!A44)","v":25},{"$f":"IF(ISBLANK(Sheet1!B44),\" \",Sheet1!B44)","v":" "},{"$f":"IF(ISBLANK(Sheet1!C44),\" \",Sheet1!C44)","v":" "},{"$f":"IF(CCA_Form_A_Part_I!I33=0,\" \",CCA_Form_A_Part_I!I33)","v":" "},{"v":0,"d":"0.00"}]
[{"$f":"IF(ISBLANK(Sheet1!A45),\" \",Sheet1!A45)","v":26},{"$f":"IF(ISBLANK(Sheet1!B45),\" \",Sheet1!B45)","v":" "},{"$f":"IF(ISBLANK(Sheet1!C45),\" \",Sheet1!C45)","v":" "},{"$f":"IF(CCA_Form_A_Part_I!I34=0,\" \",CCA_Form_A_Part_I!I34)","v":" "},{"v":0,"d":"0.00"}]
[{"$f":"IF(ISBLANK(Sheet1!A46),\" \",Sheet1!A46)","v":27},{"$f":"IF(ISBLANK(Sheet1!B46),\" \",Sheet1!B46)","v":" "},{"$f":"IF(ISBLANK(Sheet1!C46),\" \",Sheet1!C46)","v":" "},{"$f":"IF(CCA_Form_A_Part_I!I35=0,\" \",CCA_Form_A_Part_I!I35)","v":" "},{"v":0,"d":"0.00"}]
[{"$f":"IF(ISBLANK(Sheet1!A47),\" \",Sheet1!A47)","v":28},{"$f":"IF(ISBLANK(Sheet1!B47),\" \",Sheet1!B47)","v":" "},{"$f":"IF(ISBLANK(Sheet1!C47),\" \",Sheet1!C47)","v":" "},{"$f":"IF(CCA_Form_A_Part_I!I36=0,\" \",CCA_Form_A_Part_I!I36)","v":" "},{"v":0,"d":"0.00"}]
[{"$f":"IF(ISBLANK(Sheet1!A48),\" \",Sheet1!A48)","v":29},{"$f":"IF(ISBLANK(Sheet1!B48),\" \",Sheet1!B48)","v":" "},{"$f":"IF(ISBLANK(Sheet1!C48),\" \",Sheet1!C48)","v":" "},{"$f":"IF(CCA_Form_A_Part_I!I37=0,\" \",CCA_Form_A_Part_I!I37)","v":" "},{"v":0,"d":"0.00"}]
[{"$f":"IF(ISBLANK(Sheet1!A49),\" \",Sheet1!A49)","v":30},{"$f":"IF(ISBLANK(Sheet1!B49),\" \",Sheet1!B49)","v":" "},{"$f":"IF(ISBLANK(Sheet1!C49),\" \",Sheet1!C49)","v":" "},{"$f":"IF(CCA_Form_A_Part_I!I38=0,\" \",CCA_Form_A_Part_I!I38)","v":" "},{"v":0,"d":"0.00"}]
[{"$f":"IF(ISBLANK(Sheet1!A50),\" \",Sheet1!A50)","v":31},{"$f":"IF(ISBLANK(Sheet1!B50),\" \",Sheet1!B50)","v":" "},{"$f":"IF(ISBLANK(Sheet1!C50),\" \",Sheet1!C50)","v":" "},{"$f":"IF(CCA_Form_A_Part_I!I39=0,\" \",CCA_Form_A_Part_I!I39)","v":" "},{"v":0,"d":"0.00"}]
[{"$f":"IF(ISBLANK(Sheet1!A51),\" \",Sheet1!A51)","v":32},{"$f":"IF(ISBLANK(Sheet1!B51),\" \",Sheet1!B51)","v":" "},{"$f":"IF(ISBLANK(Sheet1!C51),\" \",Sheet1!C51)","v":" "},{"$f":"IF(CCA_Form_A_Part_I!I40=0,\" \",CCA_Form_A_Part_I!I40)","v":" "},{"v":0,"d":"0.00"}]
[{"$f":"IF(ISBLANK(Sheet1!A52),\" \",Sheet1!A52)","v":33},{"$f":"IF(ISBLANK(Sheet1!B52),\" \",Sheet1!B52)","v":" "},{"$f":"IF(ISBLANK(Sheet1!C52),\" \",Sheet1!C52)","v":" "},{"$f":"IF(CCA_Form_A_Part_I!I41=0,\" \",CCA_Form_A_Part_I!I41)","v":" "},{"v":0,"d":"0.00"}]
[{"$f":"IF(ISBLANK(Sheet1!A53),\" \",Sheet1!A53)","v":34},{"$f":"IF(ISBLANK(Sheet1!B53),\" \",Sheet1!B53)","v":" "},{"$f":"IF(ISBLANK(Sheet1!C53),\" \",Sheet1!C53)","v":" "},{"$f":"IF(CCA_Form_A_Part_I!I42=0,\" \",CCA_Form_A_Part_I!I42)","v":" "},{"v":0,"d":"0.00"}]
[{"$f":"IF(ISBLANK(Sheet1!A54),\" \",Sheet1!A54)","v":35},{"$f":"IF(ISBLANK(Sheet1!B54),\" \",Sheet1!B54)","v":" "},{"$f":"IF(ISBLANK(Sheet1!C54),\" \",Sheet1!C54)","v":" "},{"$f":"IF(CCA_Form_A_Part_I!I43=0,\" \",CCA_Form_A_Part_I!I43)","v":" "},{"v":0,"d":"0.00"}]
[]
["Certified that,"]
["(1) The entries are verified with the records and there is no error or omission."]
["(2) These assessments were published and no grievances are pending."]
["(3) No error(s) is/are shown in the CCA Form A Part I and CCA Form A Part II."]
[]
[]
[]
[]
["Course Faculty/Course Coordinator",null,null,"HoD",{"$nulls":3},"Principal"]

{"sheet":"CCA Form A Part II (2)","index":4,"n_rows":54,"n_cols":8,"rows_kept":54,"hidden":true,"merged":[[0,0,0,9],[1,1,1,2],[2,1,2,2],[2,4,2,5],[2,6,2,8],[3,1,3,2],[3,4,3,5],[3,6,3,8],[4,0,4,1],[4,6,4,9],[5,3,6,3],[46,0,46,3],[47,0,47,3],[48,0,48,3],[53,0,53,2],[53,3,53,4],[53,7,53,9]]}
["ST. JOSEPH'S COLLEGE, MOOLAMATTOM (AUTONOMOUS)"]
["Academic Year",{"$f":"Sheet1!D2","v":"2024-2025"}]
["Course Code:",{"$f":"Sheet1!D3","v":"MG1DSCMA101"},null,null,"Name of the Course:",null,{"$f":"Sheet1!D6","v":"INTRODUCTION TO WEB DESIGNING\t\t"}]
["Semester:",{"$f":"Sheet1!D4","v":1},null,null,"Number of Course Outcomes:",null,{"$f":"Sheet1!D7","v":9}]
["CCA Component Type (Theory/Practical):",null,{"$f":"Sheet1!D5","v":"THEORY"}]
["CO Number","CO 1","CO 2","Total Marks Allocated for CCA"]
["Evaluation Method(s) Used",{"$f":"Sheet1!A11&CHAR(10)&Sheet1!A12&CHAR(10)&Sheet1!A13&CHAR(10)&Sheet1!A14&CHAR(10)&Sheet1!A15","v":"\n\n\n\n"},{"$f":"Sheet1!D11&CHAR(10)&Sheet1!D12&CHAR(10)&Sheet1!D13&CHAR(10)&Sheet1!D14&CHAR(10)&Sheet1!D15","v":"\n\n\n\n"}]
["Maximum Marks Allocated",{"$f":"Sheet1!C16","v":0},{"$f":"Sheet1!F16","v":0},{"$f":"Sheet1!D8","v":0}]
["SL. No.","Register Number","Name of the Student","Marks Obtained in CO 1","Marks Obtained in CO 2","Total Marks Obtained in CCA"]
[{"$f":"IF(ISBLANK(Sheet1!A20),\" \",Sheet1!A20)","v":1},{"$f":"IF(ISBLANK(Sheet1!B20),\" \",Sheet1!B20)","v":" "},{"$f":"Sheet1!C20","v":0},{"$f":"IF(CCA_Form_A_Part_I!I9=0,\" \",CCA_Form_A_Part_I!I9)","v":" "},{"$f":"IF(CCA_Form_A_Part_I!O9=0,\" \",CCA_Form_A_Part_I!O9)","v":" "},{"$f":"SUM(D10:E10)","v":{"v":0,"d":"0.00"}}]
[{"$f":"IF(ISBLANK(Sheet1!A21),\" \",Sheet1!A21)","v":2},{"$f":"IF(ISBLANK(Sheet1!B21),\" \",Sheet1!B21)","v":" "},{"$f":"IF(ISBLANK(Sheet1!C21),\" \",Sheet1!C21)","v":" "},{"$f":"IF(CCA_Form_A_Part_I!I10=0,\" \",CCA_Form_A_Part_I!I10)","v":" "},{"$f":"IF(CCA_Form_A_Part_I!O10=0,\" \",CCA_Form_A_Part_I!O10)","v":" "},{"$f":"SUM(D11:E11)","v":{"v":0,"d":"0.00"}}]
[{"$f":"IF(ISBLANK(Sheet1!A22),\" \",Sheet1!A22)","v":3},{"$f":"IF(ISBLANK(Sheet1!B22),\" \",Sheet1!B22)","v":" "},{"$f":"IF(ISBLANK(Sheet1!C22),\" \",Sheet1!C22)","v":" "},{"$f":"IF(CCA_Form_A_Part_I!I11=0,\" \",CCA_Form_A_Part_I!I11)","v":" "},{"$f":"IF(CCA_Form_A_Part_I!O11=0,\" \",CCA_Form_A_Part_I!O11)","v":" "},{"v":0,"d":"0.00"}]
[{"$f":"IF(ISBLANK(Sheet1!A23),\" \",Sheet1!A23)","v":4},{"$f":"IF(ISBLANK(Sheet1!B23),\" \",Sheet1!B23)","v":" "},{"$f":"IF(ISBLANK(Sheet1!C23),\" \",Sheet1!C23)","v":" "},{"$f":"IF(CCA_Form_A_Part_I!I12=0,\" \",CCA_Form_A_Part_I!I12)","v":" "},{"$f":"IF(CCA_Form_A_Part_I!O12=0,\" \",CCA_Form_A_Part_I!O12)","v":" "},{"v":0,"d":"0.00"}]
[{"$f":"IF(ISBLANK(Sheet1!A24),\" \",Sheet1!A24)","v":5},{"$f":"IF(ISBLANK(Sheet1!B24),\" \",Sheet1!B24)","v":" "},{"$f":"IF(ISBLANK(Sheet1!C24),\" \",Sheet1!C24)","v":" "},{"$f":"IF(CCA_Form_A_Part_I!I13=0,\" \",CCA_Form_A_Part_I!I13)","v":" "},{"$f":"IF(CCA_Form_A_Part_I!O13=0,\" \",CCA_Form_A_Part_I!O13)","v":" "},{"v":0,"d":"0.00"}]
[{"$f":"IF(ISBLANK(Sheet1!A25),\" \",Sheet1!A25)","v":6},{"$f":"IF(ISBLANK(Sheet1!B25),\" \",Sheet1!B25)","v":" "},{"$f":"IF(ISBLANK(Sheet1!C25),\" \",Sheet1!C25)","v":" "},{"$f":"IF(CCA_Form_A_Part_I!I14=0,\" \",CCA_Form_A_Part_I!I14)","v":" "},{"$f":"IF(CCA_Form_A_Part_I!O14=0,\" \",CCA_Form_A_Part_I!O14)","v":" "},{"v":0,"d":"0.00"}]
[{"$f":"IF(ISBLANK(Sheet1!A26),\" \",Sheet1!A26)","v":7},{"$f":"IF(ISBLANK(Sheet1!B26),\" \",Sheet1!B26)","v":" "},{"$f":"IF(ISBLANK(Sheet1!C26),\" \",Sheet1!C26)","v":" "},{"$f":"IF(CCA_Form_A_Part_I!I15=0,\" \",CCA_Form_A_Part_I!I15)","v":" "},{"$f":"IF(CCA_Form_A_Part_I!O15=0,\" \",CCA_Form_A_Part_I!O15)","v":" "},{"v":0,"d":"0.00"}]
[{"$f":"IF(ISBLANK(Sheet1!A27),\" \",Sheet1!A27)","v":8},{"$f":"IF(ISBLANK(Sheet1!B27),\" \",Sheet1!B27)","v":" "},{"$f":"IF(ISBLANK(Sheet1!C27),\" \",Sheet1!C27)","v":" "},{"$f":"IF(CCA_Form_A_Part_I!I16=0,\" \",CCA_Form_A_Part_I!I16)","v":" "},{"$f":"IF(CCA_Form_A_Part_I!O16=0,\" \",CCA_Form_A_Part_I!O16)","v":" "},{"v":0,"d":"0.00"}]
[{"$f":"IF(ISBLANK(Sheet1!A28),\" \",Sheet1!A28)","v":9},{"$f":"IF(ISBLANK(Sheet1!B28),\" \",Sheet1!B28)","v":" "},{"$f":"IF(ISBLANK(Sheet1!C28),\" \",Sheet1!C28)","v":" "},{"$f":"IF(CCA_Form_A_Part_I!I17=0,\" \",CCA_Form_A_Part_I!I17)","v":" "},{"$f":"IF(CCA_Form_A_Part_I!O17=0,\" \",CCA_Form_A_Part_I!O17)","v":" "},{"v":0,"d":"0.00"}]
[{"$f":"IF(ISBLANK(Sheet1!A29),\" \",Sheet1!A29)","v":10},{"$f":"IF(ISBLANK(Sheet1!B29),\" \",Sheet1!B29)","v":" "},{"$f":"IF(ISBLANK(Sheet1!C29),\" \",Sheet1!C29)","v":" "},{"$f":"IF(CCA_Form_A_Part_I!I18=0,\" \",CCA_Form_A_Part_I!I18)","v":" "},{"$f":"IF(CCA_Form_A_Part_I!O18=0,\" \",CCA_Form_A_Part_I!O18)","v":" "},{"v":0,"d":"0.00"}]
[{"$f":"IF(ISBLANK(Sheet1!A30),\" \",Sheet1!A30)","v":11},{"$f":"IF(ISBLANK(Sheet1!B30),\" \",Sheet1!B30)","v":" "},{"$f":"IF(ISBLANK(Sheet1!C30),\" \",Sheet1!C30)","v":" "},{"$f":"IF(CCA_Form_A_Part_I!I19=0,\" \",CCA_Form_A_Part_I!I19)","v":" "},{"$f":"IF(CCA_Form_A_Part_I!O19=0,\" \",CCA_Form_A_Part_I!O19)","v":" "},{"v":0,"d":"0.00"}]
[{"$f":"IF(ISBLANK(Sheet1!A31),\" \",Sheet1!A31)","v":12},{"$f":"IF(ISBLANK(Sheet1!B31),\" \",Sheet1!B31)","v":" "},{"$f":"IF(ISBLANK(Sheet1!C31),\" \",Sheet1!C31)","v":" "},{"$f":"IF(CCA_Form_A_Part_I!I20=0,\" \",CCA_Form_A_Part_I!I20)","v":" "},{"$f":"IF(CCA_Form_A_Part_I!O20=0,\" \",CCA_Form_A_Part_I!O20)","v":" "},{"v":0,"d":"0.00"}]
[{"$f":"IF(ISBLANK(Sheet1!A32),\" \",Sheet1!A32)","v":13},{"$f":"IF(ISBLANK(Sheet1!B32),\" \",Sheet1!B32)","v":" "},{"$f":"IF(ISBLANK(Sheet1!C32),\" \",Sheet1!C32)","v":" "},{"$f":"IF(CCA_Form_A_Part_I!I21=0,\" \",CCA_Form_A_Part_I!I21)","v":" "},{"$f":"IF(CCA_Form_A_Part_I!O21=0,\" \",CCA_Form_A_Part_I!O21)","v":" "},{"v":0,"d":"0.00"}]
[{"$f":"IF(ISBLANK(Sheet1!A33),\" \",Sheet1!A33)","v":14},{"$f":"IF(ISBLANK(Sheet1!B33),\" \",Sheet1!B33)","v":" "},{"$f":"IF(ISBLANK(Sheet1!C33),\" \",Sheet1!C33)","v":" "},{"$f":"IF(CCA_Form_A_Part_I!I22=0,\" \",CCA_Form_A_Part_I!I22)","v":" "},{"$f":"IF(CCA_Form_A_Part_I!O22=0,\" \",CCA_Form_A_Part_I!O22)","v":" "},{"v":0,"d":"0.00"}]
[{"$f":"IF(ISBLANK(Sheet1!A34),\" \",Sheet1!A34)","v":15},{"$f":"IF(ISBLANK(Sheet1!B34),\" \",Sheet1!B34)","v":" "},{"$f":"IF(ISBLANK(Sheet1!C34),\" \",Sheet1!C34)","v":" "},{"$f":"IF(CCA_Form_A_Part_I!I23=0,\" \",CCA_Form_A_Part_I!I23)","v":" "},{"$f":"IF(CCA_Form_A_Part_I!O23=0,\" \",CCA_Form_A_Part_I!O23)","v":" "},{"v":0,"d":"0.00"}]
[{"$f":"IF(ISBLANK(Sheet1!A35),\" \",Sheet1!A35)","v":16},{"$f":"IF(ISBLANK(Sheet1!B35),\" \",Sheet1!B35)","v":" "},{"$f":"IF(ISBLANK(Sheet1!C35),\" \",Sheet1!C35)","v":" "},{"$f":"IF(CCA_Form_A_Part_I!I24=0,\" \",CCA_Form_A_Part_I!I24)","v":" "},{"$f":"IF(CCA_Form_A_Part_I!O24=0,\" \",CCA_Form_A_Part_I!O24)","v":" "},{"v":0,"d":"0.00"}]
[{"$f":"IF(ISBLANK(Sheet1!A36),\" \",Sheet1!A36)","v":17},{"$f":"IF(ISBLANK(Sheet1!B36),\" \",Sheet1!B36)","v":" "},{"$f":"IF(ISBLANK(Sheet1!C36),\" \",Sheet1!C36)","v":" "},{"$f":"IF(CCA_Form_A_Part_I!I25=0,\" \",CCA_Form_A_Part_I!I25)","v":" "},{"$f":"IF(CCA_Form_A_Part_I!O25=0,\" \",CCA_Form_A_Part_I!O25)","v":" "},{"v":0,"d":"0.00"}]
[{"$f":"IF(ISBLANK(Sheet1!A37),\" \",Sheet1!A37)","v":18},{"$f":"IF(ISBLANK(Sheet1!B37),\" \",Sheet1!B37)","v":" "},{"$f":"IF(ISBLANK(Sheet1!C37),\" \",Sheet1!C37)","v":" "},{"$f":"IF(CCA_Form_A_Part_I!I26=0,\" \",CCA_Form_A_Part_I!I26)","v":" "},{"$f":"IF(CCA_Form_A_Part_I!O26=0,\" \",CCA_Form_A_Part_I!O26)","v":" "},{"v":0,"d":"0.00"}]
[{"$f":"IF(ISBLANK(Sheet1!A38),\" \",Sheet1!A38)","v":19},{"$f":"IF(ISBLANK(Sheet1!B38),\" \",Sheet1!B38)","v":" "},{"$f":"IF(ISBLANK(Sheet1!C38),\" \",Sheet1!C38)","v":" "},{"$f":"IF(CCA_Form_A_Part_I!I27=0,\" \",CCA_Form_A_Part_I!I27)","v":" "},{"$f":"IF(CCA_Form_A_Part_I!O27=0,\" \",CCA_Form_A_Part_I!O27)","v":" "},{"v":0,"d":"0.00"}]
[{"$f":"IF(ISBLANK(Sheet1!A39),\" \",Sheet1!A39)","v":20},{"$f":"IF(ISBLANK(Sheet1!B39),\" \",Sheet1!B39)","v":" "},{"$f":"IF(ISBLANK(Sheet1!C39),\" \",Sheet1!C39)","v":" "},{"$f":"IF(CCA_Form_A_Part_I!I28=0,\" \",CCA_Form_A_Part_I!I28)","v":" "},{"$f":"IF(CCA_Form_A_Part_I!O28=0,\" \",CCA_Form_A_Part_I!O28)","v":" "},{"v":0,"d":"0.00"}]
[{"$f":"IF(ISBLANK(Sheet1!A40),\" \",Sheet1!A40)","v":21},{"$f":"IF(ISBLANK(Sheet1!B40),\" \",Sheet1!B40)","v":" "},{"$f":"IF(ISBLANK(Sheet1!C40),\" \",Sheet1!C40)","v":" "},{"$f":"IF(CCA_Form_A_Part_I!I29=0,\" \",CCA_Form_A_Part_I!I29)","v":" "},{"$f":"IF(CCA_Form_A_Part_I!O29=0,\" \",CCA_Form_A_Part_I!O29)","v":" "},{"v":0,"d":"0.00"}]
[{"$f":"IF(ISBLANK(Sheet1!A41),\" \",Sheet1!A41)","v":22},{"$f":"IF(ISBLANK(Sheet1!B41),\" \",Sheet1!B41)","v":" "},{"$f":"IF(ISBLANK(Sheet1!C41),\" \",Sheet1!C41)","v":" "},{"$f":"IF(CCA_Form_A_Part_I!I30=0,\" \",CCA_Form_A_Part_I!I30)","v":" "},{"$f":"IF(CCA_Form_A_Part_I!O30=0,\" \",CCA_Form_A_Part_I!O30)","v":" "},{"v":0,"d":"0.00"}]
[{"$f":"IF(ISBLANK(Sheet1!A42),\" \",Sheet1!A42)","v":23},{"$f":"IF(ISBLANK(Sheet1!B42),\" \",Sheet1!B42)","v":" "},{"$f":"IF(ISBLANK(Sheet1!C42),\" \",Sheet1!C42)","v":" "},{"$f":"IF(CCA_Form_A_Part_I!I31=0,\" \",CCA_Form_A_Part_I!I31)","v":" "},{"$f":"IF(CCA_Form_A_Part_I!O31=0,\" \",CCA_Form_A_Part_I!O31)","v":" "},{"v":0,"d":"0.00"}]
[{"$f":"IF(ISBLANK(Sheet1!A43),\" \",Sheet1!A43)","v":24},{"$f":"IF(ISBLANK(Sheet1!B43),\" \",Sheet1!B43)","v":" "},{"$f":"IF(ISBLANK(Sheet1!C43),\" \",Sheet1!C43)","v":" "},{"$f":"IF(CCA_Form_A_Part_I!I32=0,\" \",CCA_Form_A_Part_I!I32)","v":" "},{"$f":"IF(CCA_Form_A_Part_I!O32=0,\" \",CCA_Form_A_Part_I!O32)","v":" "},{"v":0,"d":"0.00"}]
[{"$f":"IF(ISBLANK(Sheet1!A44),\" \",Sheet1!A44)","v":25},{"$f":"IF(ISBLANK(Sheet1!B44),\" \",Sheet1!B44)","v":" "},{"$f":"IF(ISBLANK(Sheet1!C44),\" \",Sheet1!C44)","v":" "},{"$f":"IF(CCA_Form_A_Part_I!I33=0,\" \",CCA_Form_A_Part_I!I33)","v":" "},{"$f":"IF(CCA_Form_A_Part_I!O33=0,\" \",CCA_Form_A_Part_I!O33)","v":" "},{"v":0,"d":"0.00"}]
[{"$f":"IF(ISBLANK(Sheet1!A45),\" \",Sheet1!A45)","v":26},{"$f":"IF(ISBLANK(Sheet1!B45),\" \",Sheet1!B45)","v":" "},{"$f":"IF(ISBLANK(Sheet1!C45),\" \",Sheet1!C45)","v":" "},{"$f":"IF(CCA_Form_A_Part_I!I34=0,\" \",CCA_Form_A_Part_I!I34)","v":" "},{"$f":"IF(CCA_Form_A_Part_I!O34=0,\" \",CCA_Form_A_Part_I!O34)","v":" "},{"v":0,"d":"0.00"}]
[{"$f":"IF(ISBLANK(Sheet1!A46),\" \",Sheet1!A46)","v":27},{"$f":"IF(ISBLANK(Sheet1!B46),\" \",Sheet1!B46)","v":" "},{"$f":"IF(ISBLANK(Sheet1!C46),\" \",Sheet1!C46)","v":" "},{"$f":"IF(CCA_Form_A_Part_I!I35=0,\" \",CCA_Form_A_Part_I!I35)","v":" "},{"$f":"IF(CCA_Form_A_Part_I!O35=0,\" \",CCA_Form_A_Part_I!O35)","v":" "},{"v":0,"d":"0.00"}]
[{"$f":"IF(ISBLANK(Sheet1!A47),\" \",Sheet1!A47)","v":28},{"$f":"IF(ISBLANK(Sheet1!B47),\" \",Sheet1!B47)","v":" "},{"$f":"IF(ISBLANK(Sheet1!C47),\" \",Sheet1!C47)","v":" "},{"$f":"IF(CCA_Form_A_Part_I!I36=0,\" \",CCA_Form_A_Part_I!I36)","v":" "},{"$f":"IF(CCA_Form_A_Part_I!O36=0,\" \",CCA_Form_A_Part_I!O36)","v":" "},{"v":0,"d":"0.00"}]
[{"$f":"IF(ISBLANK(Sheet1!A48),\" \",Sheet1!A48)","v":29},{"$f":"IF(ISBLANK(Sheet1!B48),\" \",Sheet1!B48)","v":" "},{"$f":"IF(ISBLANK(Sheet1!C48),\" \",Sheet1!C48)","v":" "},{"$f":"IF(CCA_Form_A_Part_I!I37=0,\" \",CCA_Form_A_Part_I!I37)","v":" "},{"$f":"IF(CCA_Form_A_Part_I!O37=0,\" \",CCA_Form_A_Part_I!O37)","v":" "},{"v":0,"d":"0.00"}]
[{"$f":"IF(ISBLANK(Sheet1!A49),\" \",Sheet1!A49)","v":30},{"$f":"IF(ISBLANK(Sheet1!B49),\" \",Sheet1!B49)","v":" "},{"$f":"IF(ISBLANK(Sheet1!C49),\" \",Sheet1!C49)","v":" "},{"$f":"IF(CCA_Form_A_Part_I!I38=0,\" \",CCA_Form_A_Part_I!I38)","v":" "},{"$f":"IF(CCA_Form_A_Part_I!O38=0,\" \",CCA_Form_A_Part_I!O38)","v":" "},{"v":0,"d":"0.00"}]
[{"$f":"IF(ISBLANK(Sheet1!A50),\" \",Sheet1!A50)","v":31},{"$f":"IF(ISBLANK(Sheet1!B50),\" \",Sheet1!B50)","v":" "},{"$f":"IF(ISBLANK(Sheet1!C50),\" \",Sheet1!C50)","v":" "},{"$f":"IF(CCA_Form_A_Part_I!I39=0,\" \",CCA_Form_A_Part_I!I39)","v":" "},{"$f":"IF(CCA_Form_A_Part_I!O39=0,\" \",CCA_Form_A_Part_I!O39)","v":" "},{"v":0,"d":"0.00"}]
[{"$f":"IF(ISBLANK(Sheet1!A51),\" \",Sheet1!A51)","v":32},{"$f":"IF(ISBLANK(Sheet1!B51),\" \",Sheet1!B51)","v":" "},{"$f":"IF(ISBLANK(Sheet1!C51),\" \",Sheet1!C51)","v":" "},{"$f":"IF(CCA_Form_A_Part_I!I40=0,\" \",CCA_Form_A_Part_I!I40)","v":" "},{"$f":"IF(CCA_Form_A_Part_I!O40=0,\" \",CCA_Form_A_Part_I!O40)","v":" "},{"v":0,"d":"0.00"}]
[{"$f":"IF(ISBLANK(Sheet1!A52),\" \",Sheet1!A52)","v":33},{"$f":"IF(ISBLANK(Sheet1!B52),\" \",Sheet1!B52)","v":" "},{"$f":"IF(ISBLANK(Sheet1!C52),\" \",Sheet1!C52)","v":" "},{"$f":"IF(CCA_Form_A_Part_I!I41=0,\" \",CCA_Form_A_Part_I!I41)","v":" "},{"$f":"IF(CCA_Form_A_Part_I!O41=0,\" \",CCA_Form_A_Part_I!O41)","v":" "},{"v":0,"d":"0.00"}]
[{"$f":"IF(ISBLANK(Sheet1!A53),\" \",Sheet1!A53)","v":34},{"$f":"IF(ISBLANK(Sheet1!B53),\" \",Sheet1!B53)","v":" "},{"$f":"IF(ISBLANK(Sheet1!C53),\" \",Sheet1!C53)","v":" "},{"$f":"IF(CCA_Form_A_Part_I!I42=0,\" \",CCA_Form_A_Part_I!I42)","v":" "},{"$f":"IF(CCA_Form_A_Part_I!O42=0,\" \",CCA_Form_A_Part_I!O42)","v":" "},{"v":0,"d":"0.00"}]
[{"$f":"IF(ISBLANK(Sheet1!A54),\" \",Sheet1!A54)","v":35},{"$f":"IF(ISBLANK(Sheet1!B54),\" \",Sheet1!B54)","v":" "},{"$f":"IF(ISBLANK(Sheet1!C54),\" \",Sheet1!C54)","v":" "},{"$f":"IF(CCA_Form_A_Part_I!I43=0,\" \",CCA_Form_A_Part_I!I43)","v":" "},{"$f":"IF(CCA_Form_A_Part_I!O43=0,\" \",CCA_Form_A_Part_I!O43)","v":" "},{"v":0,"d":"0.00"}]
[]
["Certified that,"]
["(1) The entries are verified with the records and there is no error or omission."]
["(2) These assessments were published and no grievances are pending."]
["(3) No error(s) is/are shown in the CCA Form A Part I and CCA Form A Part II."]
[]
[]
[]
[]
["Course Faculty/Course Coordinator",null,null,"HoD",{"$nulls":3},"Principal"]

{"sheet":"CCA Form A Part II (3)","index":5,"n_rows":54,"n_cols":8,"rows_kept":54,"hidden":true,"merged":[[0,0,0,9],[1,1,1,2],[2,1,2,2],[2,4,2,5],[2,6,2,8],[3,1,3,2],[3,4,3,5],[3,6,3,8],[4,0,4,1],[4,6,4,9],[5,4,6,4],[46,0,46,3],[47,0,47,3],[48,0,48,3],[53,0,53,2],[53,3,53,4],[53,7,53,9]]}
["ST. JOSEPH'S COLLEGE, MOOLAMATTOM (AUTONOMOUS)"]
["Academic Year",{"$f":"Sheet1!D2","v":"2024-2025"}]
["Course Code:",{"$f":"Sheet1!D3","v":"MG1DSCMA101"},null,null,"Name of the Course:",null,{"$f":"Sheet1!D6","v":"INTRODUCTION TO WEB DESIGNING\t\t"}]
["Semester:",{"$f":"Sheet1!D4","v":1},null,null,"Number of Course Outcomes:",null,{"$f":"Sheet1!D7","v":9}]
["CCA Component Type (Theory/Practical):",null,{"$f":"Sheet1!D5","v":"THEORY"}]
["CO Number","CO 1","CO 2","CO 3","Total Marks Allocated for CCA"]
["Evaluation Method(s) Used",{"$f":"Sheet1!A11&CHAR(10)&Sheet1!A12&CHAR(10)&Sheet1!A13&CHAR(10)&Sheet1!A14&CHAR(10)&Sheet1!A15","v":"\n\n\n\n"},{"$f":"Sheet1!D11&CHAR(10)&Sheet1!D12&CHAR(10)&Sheet1!D13&CHAR(10)&Sheet1!D14&CHAR(10)&Sheet1!D15","v":"\n\n\n\n"},{"$f":"Sheet1!G11&CHAR(10)&Sheet1!G12&CHAR(10)&Sheet1!G13&CHAR(10)&Sheet1!G14&CHAR(10)&Sheet1!G15","v":"\n\n\n\n"}]
["Maximum Marks Allocated",{"$f":"Sheet1!C16","v":0},{"$f":"Sheet1!F16","v":0},{"$f":"Sheet1!I16","v":0},{"$f":"Sheet1!D8","v":0}]
["SL. No.","Register Number","Name of the Student","Marks Obtained in CO 1","Marks Obtained in CO 2","Marks Obtained in CO 3","Total Marks Obtained in CCA"]
[{"$f":"IF(ISBLANK(Sheet1!A20),\" \",Sheet1!A20)","v":1},{"$f":"IF(ISBLANK(Sheet1!B20),\" \",Sheet1!B20)","v":" "},{"$f":"Sheet1!C20","v":0},{"$f":"IF(CCA_Form_A_Part_I!I9=0,\" \",CCA_Form_A_Part_I!I9)","v":" "},{"$f":"IF(CCA_Form_A_Part_I!O9=0,\" \",CCA_Form_A_Part_I!O9)","v":" "},{"$f":"IF(CCA_Form_A_Part_I!U9=0,\" \",CCA_Form_A_Part_I!U9)","v":" "},{"$f":"SUM(D10:F10)","v":{"v":0,"d":"0.00"}}]
[{"$f":"IF(ISBLANK(Sheet1!A21),\" \",Sheet1!A21)","v":2},{"$f":"IF(ISBLANK(Sheet1!B21),\" \",Sheet1!B21)","v":" "},{"$f":"IF(ISBLANK(Sheet1!C21),\" \",Sheet1!C21)","v":" "},{"$f":"IF(CCA_Form_A_Part_I!I10=0,\" \",CCA_Form_A_Part_I!I10)","v":" "},{"$f":"IF(CCA_Form_A_Part_I!O10=0,\" \",CCA_Form_A_Part_I!O10)","v":" "},{"$f":"IF(CCA_Form_A_Part_I!U10=0,\" \",CCA_Form_A_Part_I!U10)","v":" "},{"$f":"SUM(D11:F11)","v":{"v":0,"d":"0.00"}}]
[{"$f":"IF(ISBLANK(Sheet1!A22),\" \",Sheet1!A22)","v":3},{"$f":"IF(ISBLANK(Sheet1!B22),\" \",Sheet1!B22)","v":" "},{"$f":"IF(ISBLANK(Sheet1!C22),\" \",Sheet1!C22)","v":" "},{"$f":"IF(CCA_Form_A_Part_I!I11=0,\" \",CCA_Form_A_Part_I!I11)","v":" "},{"$f":"IF(CCA_Form_A_Part_I!O11=0,\" \",CCA_Form_A_Part_I!O11)","v":" "},{"$f":"IF(CCA_Form_A_Part_I!U11=0,\" \",CCA_Form_A_Part_I!U11)","v":" "},{"v":0,"d":"0.00"}]
[{"$f":"IF(ISBLANK(Sheet1!A23),\" \",Sheet1!A23)","v":4},{"$f":"IF(ISBLANK(Sheet1!B23),\" \",Sheet1!B23)","v":" "},{"$f":"IF(ISBLANK(Sheet1!C23),\" \",Sheet1!C23)","v":" "},{"$f":"IF(CCA_Form_A_Part_I!I12=0,\" \",CCA_Form_A_Part_I!I12)","v":" "},{"$f":"IF(CCA_Form_A_Part_I!O12=0,\" \",CCA_Form_A_Part_I!O12)","v":" "},{"$f":"IF(CCA_Form_A_Part_I!U12=0,\" \",CCA_Form_A_Part_I!U12)","v":" "},{"v":0,"d":"0.00"}]
[{"$f":"IF(ISBLANK(Sheet1!A24),\" \",Sheet1!A24)","v":5},{"$f":"IF(ISBLANK(Sheet1!B24),\" \",Sheet1!B24)","v":" "},{"$f":"IF(ISBLANK(Sheet1!C24),\" \",Sheet1!C24)","v":" "},{"$f":"IF(CCA_Form_A_Part_I!I13=0,\" \",CCA_Form_A_Part_I!I13)","v":" "},{"$f":"IF(CCA_Form_A_Part_I!O13=0,\" \",CCA_Form_A_Part_I!O13)","v":" "},{"$f":"IF(CCA_Form_A_Part_I!U13=0,\" \",CCA_Form_A_Part_I!U13)","v":" "},{"v":0,"d":"0.00"}]
[{"$f":"IF(ISBLANK(Sheet1!A25),\" \",Sheet1!A25)","v":6},{"$f":"IF(ISBLANK(Sheet1!B25),\" \",Sheet1!B25)","v":" "},{"$f":"IF(ISBLANK(Sheet1!C25),\" \",Sheet1!C25)","v":" "},{"$f":"IF(CCA_Form_A_Part_I!I14=0,\" \",CCA_Form_A_Part_I!I14)","v":" "},{"$f":"IF(CCA_Form_A_Part_I!O14=0,\" \",CCA_Form_A_Part_I!O14)","v":" "},{"$f":"IF(CCA_Form_A_Part_I!U14=0,\" \",CCA_Form_A_Part_I!U14)","v":" "},{"v":0,"d":"0.00"}]
[{"$f":"IF(ISBLANK(Sheet1!A26),\" \",Sheet1!A26)","v":7},{"$f":"IF(ISBLANK(Sheet1!B26),\" \",Sheet1!B26)","v":" "},{"$f":"IF(ISBLANK(Sheet1!C26),\" \",Sheet1!C26)","v":" "},{"$f":"IF(CCA_Form_A_Part_I!I15=0,\" \",CCA_Form_A_Part_I!I15)","v":" "},{"$f":"IF(CCA_Form_A_Part_I!O15=0,\" \",CCA_Form_A_Part_I!O15)","v":" "},{"$f":"IF(CCA_Form_A_Part_I!U15=0,\" \",CCA_Form_A_Part_I!U15)","v":" "},{"v":0,"d":"0.00"}]
[{"$f":"IF(ISBLANK(Sheet1!A27),\" \",Sheet1!A27)","v":8},{"$f":"IF(ISBLANK(Sheet1!B27),\" \",Sheet1!B27)","v":" "},{"$f":"IF(ISBLANK(Sheet1!C27),\" \",Sheet1!C27)","v":" "},{"$f":"IF(CCA_Form_A_Part_I!I16=0,\" \",CCA_Form_A_Part_I!I16)","v":" "},{"$f":"IF(CCA_Form_A_Part_I!O16=0,\" \",CCA_Form_A_Part_I!O16)","v":" "},{"$f":"IF(CCA_Form_A_Part_I!U16=0,\" \",CCA_Form_A_Part_I!U16)","v":" "},{"v":0,"d":"0.00"}]
[{"$f":"IF(ISBLANK(Sheet1!A28),\" \",Sheet1!A28)","v":9},{"$f":"IF(ISBLANK(Sheet1!B28),\" \",Sheet1!B28)","v":" "},{"$f":"IF(ISBLANK(Sheet1!C28),\" \",Sheet1!C28)","v":" "},{"$f":"IF(CCA_Form_A_Part_I!I17=0,\" \",CCA_Form_A_Part_I!I17)","v":" "},{"$f":"IF(CCA_Form_A_Part_I!O17=0,\" \",CCA_Form_A_Part_I!O17)","v":" "},{"$f":"IF(CCA_Form_A_Part_I!U17=0,\" \",CCA_Form_A_Part_I!U17)","v":" "},{"v":0,"d":"0.00"}]
[{"$f":"IF(ISBLANK(Sheet1!A29),\" \",Sheet1!A29)","v":10},{"$f":"IF(ISBLANK(Sheet1!B29),\" \",Sheet1!B29)","v":" "},{"$f":"IF(ISBLANK(Sheet1!C29),\" \",Sheet1!C29)","v":" "},{"$f":"IF(CCA_Form_A_Part_I!I18=0,\" \",CCA_Form_A_Part_I!I18)","v":" "},{"$f":"IF(CCA_Form_A_Part_I!O18=0,\" \",CCA_Form_A_Part_I!O18)","v":" "},{"$f":"IF(CCA_Form_A_Part_I!U18=0,\" \",CCA_Form_A_Part_I!U18)","v":" "},{"v":0,"d":"0.00"}]
[{"$f":"IF(ISBLANK(Sheet1!A30),\" \",Sheet1!A30)","v":11},{"$f":"IF(ISBLANK(Sheet1!B30),\" \",Sheet1!B30)","v":" "},{"$f":"IF(ISBLANK(Sheet1!C30),\" \",Sheet1!C30)","v":" "},{"$f":"IF(CCA_Form_A_Part_I!I19=0,\" \",CCA_Form_A_Part_I!I19)","v":" "},{"$f":"IF(CCA_Form_A_Part_I!O19=0,\" \",CCA_Form_A_Part_I!O19)","v":" "},{"$f":"IF(CCA_Form_A_Part_I!U19=0,\" \",CCA_Form_A_Part_I!U19)","v":" "},{"v":0,"d":"0.00"}]
[{"$f":"IF(ISBLANK(Sheet1!A31),\" \",Sheet1!A31)","v":12},{"$f":"IF(ISBLANK(Sheet1!B31),\" \",Sheet1!B31)","v":" "},{"$f":"IF(ISBLANK(Sheet1!C31),\" \",Sheet1!C31)","v":" "},{"$f":"IF(CCA_Form_A_Part_I!I20=0,\" \",CCA_Form_A_Part_I!I20)","v":" "},{"$f":"IF(CCA_Form_A_Part_I!O20=0,\" \",CCA_Form_A_Part_I!O20)","v":" "},{"$f":"IF(CCA_Form_A_Part_I!U20=0,\" \",CCA_Form_A_Part_I!U20)","v":" "},{"v":0,"d":"0.00"}]
[{"$f":"IF(ISBLANK(Sheet1!A32),\" \",Sheet1!A32)","v":13},{"$f":"IF(ISBLANK(Sheet1!B32),\" \",Sheet1!B32)","v":" "},{"$f":"IF(ISBLANK(Sheet1!C32),\" \",Sheet1!C32)","v":" "},{"$f":"IF(CCA_Form_A_Part_I!I21=0,\" \",CCA_Form_A_Part_I!I21)","v":" "},{"$f":"IF(CCA_Form_A_Part_I!O21=0,\" \",CCA_Form_A_Part_I!O21)","v":" "},{"$f":"IF(CCA_Form_A_Part_I!U21=0,\" \",CCA_Form_A_Part_I!U21)","v":" "},{"v":0,"d":"0.00"}]
[{"$f":"IF(ISBLANK(Sheet1!A33),\" \",Sheet1!A33)","v":14},{"$f":"IF(ISBLANK(Sheet1!B33),\" \",Sheet1!B33)","v":" "},{"$f":"IF(ISBLANK(Sheet1!C33),\" \",Sheet1!C33)","v":" "},{"$f":"IF(CCA_Form_A_Part_I!I22=0,\" \",CCA_Form_A_Part_I!I22)","v":" "},{"$f":"IF(CCA_Form_A_Part_I!O22=0,\" \",CCA_Form_A_Part_I!O22)","v":" "},{"$f":"IF(CCA_Form_A_Part_I!U22=0,\" \",CCA_Form_A_Part_I!U22)","v":" "},{"v":0,"d":"0.00"}]
[{"$f":"IF(ISBLANK(Sheet1!A34),\" \",Sheet1!A34)","v":15},{"$f":"IF(ISBLANK(Sheet1!B34),\" \",Sheet1!B34)","v":" "},{"$f":"IF(ISBLANK(Sheet1!C34),\" \",Sheet1!C34)","v":" "},{"$f":"IF(CCA_Form_A_Part_I!I23=0,\" \",CCA_Form_A_Part_I!I23)","v":" "},{"$f":"IF(CCA_Form_A_Part_I!O23=0,\" \",CCA_Form_A_Part_I!O23)","v":" "},{"$f":"IF(CCA_Form_A_Part_I!U23=0,\" \",CCA_Form_A_Part_I!U23)","v":" "},{"v":0,"d":"0.00"}]
[{"$f":"IF(ISBLANK(Sheet1!A35),\" \",Sheet1!A35)","v":16},{"$f":"IF(ISBLANK(Sheet1!B35),\" \",Sheet1!B35)","v":" "},{"$f":"IF(ISBLANK(Sheet1!C35),\" \",Sheet1!C35)","v":" "},{"$f":"IF(CCA_Form_A_Part_I!I24=0,\" \",CCA_Form_A_Part_I!I24)","v":" "},{"$f":"IF(CCA_Form_A_Part_I!O24=0,\" \",CCA_Form_A_Part_I!O24)","v":" "},{"$f":"IF(CCA_Form_A_Part_I!U24=0,\" \",CCA_Form_A_Part_I!U24)","v":" "},{"v":0,"d":"0.00"}]
[{"$f":"IF(ISBLANK(Sheet1!A36),\" \",Sheet1!A36)","v":17},{"$f":"IF(ISBLANK(Sheet1!B36),\" \",Sheet1!B36)","v":" "},{"$f":"IF(ISBLANK(Sheet1!C36),\" \",Sheet1!C36)","v":" "},{"$f":"IF(CCA_Form_A_Part_I!I25=0,\" \",CCA_Form_A_Part_I!I25)","v":" "},{"$f":"IF(CCA_Form_A_Part_I!O25=0,\" \",CCA_Form_A_Part_I!O25)","v":" "},{"$f":"IF(CCA_Form_A_Part_I!U25=0,\" \",CCA_Form_A_Part_I!U25)","v":" "},{"v":0,"d":"0.00"}]
[{"$f":"IF(ISBLANK(Sheet1!A37),\" \",Sheet1!A37)","v":18},{"$f":"IF(ISBLANK(Sheet1!B37),\" \",Sheet1!B37)","v":" "},{"$f":"IF(ISBLANK(Sheet1!C37),\" \",Sheet1!C37)","v":" "},{"$f":"IF(CCA_Form_A_Part_I!I26=0,\" \",CCA_Form_A_Part_I!I26)","v":" "},{"$f":"IF(CCA_Form_A_Part_I!O26=0,\" \",CCA_Form_A_Part_I!O26)","v":" "},{"$f":"IF(CCA_Form_A_Part_I!U26=0,\" \",CCA_Form_A_Part_I!U26)","v":" "},{"v":0,"d":"0.00"}]
[{"$f":"IF(ISBLANK(Sheet1!A38),\" \",Sheet1!A38)","v":19},{"$f":"IF(ISBLANK(Sheet1!B38),\" \",Sheet1!B38)","v":" "},{"$f":"IF(ISBLANK(Sheet1!C38),\" \",Sheet1!C38)","v":" "},{"$f":"IF(CCA_Form_A_Part_I!I27=0,\" \",CCA_Form_A_Part_I!I27)","v":" "},{"$f":"IF(CCA_Form_A_Part_I!O27=0,\" \",CCA_Form_A_Part_I!O27)","v":" "},{"$f":"IF(CCA_Form_A_Part_I!U27=0,\" \",CCA_Form_A_Part_I!U27)","v":" "},{"v":0,"d":"0.00"}]
[{"$f":"IF(ISBLANK(Sheet1!A39),\" \",Sheet1!A39)","v":20},{"$f":"IF(ISBLANK(Sheet1!B39),\" \",Sheet1!B39)","v":" "},{"$f":"IF(ISBLANK(Sheet1!C39),\" \",Sheet1!C39)","v":" "},{"$f":"IF(CCA_Form_A_Part_I!I28=0,\" \",CCA_Form_A_Part_I!I28)","v":" "},{"$f":"IF(CCA_Form_A_Part_I!O28=0,\" \",CCA_Form_A_Part_I!O28)","v":" "},{"$f":"IF(CCA_Form_A_Part_I!U28=0,\" \",CCA_Form_A_Part_I!U28)","v":" "},{"v":0,"d":"0.00"}]
[{"$f":"IF(ISBLANK(Sheet1!A40),\" \",Sheet1!A40)","v":21},{"$f":"IF(ISBLANK(Sheet1!B40),\" \",Sheet1!B40)","v":" "},{"$f":"IF(ISBLANK(Sheet1!C40),\" \",Sheet1!C40)","v":" "},{"$f":"IF(CCA_Form_A_Part_I!I29=0,\" \",CCA_Form_A_Part_I!I29)","v":" "},{"$f":"IF(CCA_Form_A_Part_I!O29=0,\" \",CCA_Form_A_Part_I!O29)","v":" "},{"$f":"IF(CCA_Form_A_Part_I!U29=0,\" \",CCA_Form_A_Part_I!U29)","v":" "},{"v":0,"d":"0.00"}]
[{"$f":"IF(ISBLANK(Sheet1!A41),\" \",Sheet1!A41)","v":22},{"$f":"IF(ISBLANK(Sheet1!B41),\" \",Sheet1!B41)","v":" "},{"$f":"IF(ISBLANK(Sheet1!C41),\" \",Sheet1!C41)","v":" "},{"$f":"IF(CCA_Form_A_Part_I!I30=0,\" \",CCA_Form_A_Part_I!I30)","v":" "},{"$f":"IF(CCA_Form_A_Part_I!O30=0,\" \",CCA_Form_A_Part_I!O30)","v":" "},{"$f":"IF(CCA_Form_A_Part_I!U30=0,\" \",CCA_Form_A_Part_I!U30)","v":" "},{"v":0,"d":"0.00"}]
[{"$f":"IF(ISBLANK(Sheet1!A42),\" \",Sheet1!A42)","v":23},{"$f":"IF(ISBLANK(Sheet1!B42),\" \",Sheet1!B42)","v":" "},{"$f":"IF(ISBLANK(Sheet1!C42),\" \",Sheet1!C42)","v":" "},{"$f":"IF(CCA_Form_A_Part_I!I31=0,\" \",CCA_Form_A_Part_I!I31)","v":" "},{"$f":"IF(CCA_Form_A_Part_I!O31=0,\" \",CCA_Form_A_Part_I!O31)","v":" "},{"$f":"IF(CCA_Form_A_Part_I!U31=0,\" \",CCA_Form_A_Part_I!U31)","v":" "},{"v":0,"d":"0.00"}]
[{"$f":"IF(ISBLANK(Sheet1!A43),\" \",Sheet1!A43)","v":24},{"$f":"IF(ISBLANK(Sheet1!B43),\" \",Sheet1!B43)","v":" "},{"$f":"IF(ISBLANK(Sheet1!C43),\" \",Sheet1!C43)","v":" "},{"$f":"IF(CCA_Form_A_Part_I!I32=0,\" \",CCA_Form_A_Part_I!I32)","v":" "},{"$f":"IF(CCA_Form_A_Part_I!O32=0,\" \",CCA_Form_A_Part_I!O32)","v":" "},{"$f":"IF(CCA_Form_A_Part_I!U32=0,\" \",CCA_Form_A_Part_I!U32)","v":" "},{"v":0,"d":"0.00"}]
[{"$f":"IF(ISBLANK(Sheet1!A44),\" \",Sheet1!A44)","v":25},{"$f":"IF(ISBLANK(Sheet1!B44),\" \",Sheet1!B44)","v":" "},{"$f":"IF(ISBLANK(Sheet1!C44),\" \",Sheet1!C44)","v":" "},{"$f":"IF(CCA_Form_A_Part_I!I33=0,\" \",CCA_Form_A_Part_I!I33)","v":" "},{"$f":"IF(CCA_Form_A_Part_I!O33=0,\" \",CCA_Form_A_Part_I!O33)","v":" "},{"$f":"IF(CCA_Form_A_Part_I!U33=0,\" \",CCA_Form_A_Part_I!U33)","v":" "},{"v":0,"d":"0.00"}]
[{"$f":"IF(ISBLANK(Sheet1!A45),\" \",Sheet1!A45)","v":26},{"$f":"IF(ISBLANK(Sheet1!B45),\" \",Sheet1!B45)","v":" "},{"$f":"IF(ISBLANK(Sheet1!C45),\" \",Sheet1!C45)","v":" "},{"$f":"IF(CCA_Form_A_Part_I!I34=0,\" \",CCA_Form_A_Part_I!I34)","v":" "},{"$f":"IF(CCA_Form_A_Part_I!O34=0,\" \",CCA_Form_A_Part_I!O34)","v":" "},{"$f":"IF(CCA_Form_A_Part_I!U34=0,\" \",CCA_Form_A_Part_I!U34)","v":" "},{"v":0,"d":"0.00"}]
[{"$f":"IF(ISBLANK(Sheet1!A46),\" \",Sheet1!A46)","v":27},{"$f":"IF(ISBLANK(Sheet1!B46),\" \",Sheet1!B46)","v":" "},{"$f":"IF(ISBLANK(Sheet1!C46),\" \",Sheet1!C46)","v":" "},{"$f":"IF(CCA_Form_A_Part_I!I35=0,\" \",CCA_Form_A_Part_I!I35)","v":" "},{"$f":"IF(CCA_Form_A_Part_I!O35=0,\" \",CCA_Form_A_Part_I!O35)","v":" "},{"$f":"IF(CCA_Form_A_Part_I!U35=0,\" \",CCA_Form_A_Part_I!U35)","v":" "},{"v":0,"d":"0.00"}]
[{"$f":"IF(ISBLANK(Sheet1!A47),\" \",Sheet1!A47)","v":28},{"$f":"IF(ISBLANK(Sheet1!B47),\" \",Sheet1!B47)","v":" "},{"$f":"IF(ISBLANK(Sheet1!C47),\" \",Sheet1!C47)","v":" "},{"$f":"IF(CCA_Form_A_Part_I!I36=0,\" \",CCA_Form_A_Part_I!I36)","v":" "},{"$f":"IF(CCA_Form_A_Part_I!O36=0,\" \",CCA_Form_A_Part_I!O36)","v":" "},{"$f":"IF(CCA_Form_A_Part_I!U36=0,\" \",CCA_Form_A_Part_I!U36)","v":" "},{"v":0,"d":"0.00"}]
[{"$f":"IF(ISBLANK(Sheet1!A48),\" \",Sheet1!A48)","v":29},{"$f":"IF(ISBLANK(Sheet1!B48),\" \",Sheet1!B48)","v":" "},{"$f":"IF(ISBLANK(Sheet1!C48),\" \",Sheet1!C48)","v":" "},{"$f":"IF(CCA_Form_A_Part_I!I37=0,\" \",CCA_Form_A_Part_I!I37)","v":" "},{"$f":"IF(CCA_Form_A_Part_I!O37=0,\" \",CCA_Form_A_Part_I!O37)","v":" "},{"$f":"IF(CCA_Form_A_Part_I!U37=0,\" \",CCA_Form_A_Part_I!U37)","v":" "},{"v":0,"d":"0.00"}]
[{"$f":"IF(ISBLANK(Sheet1!A49),\" \",Sheet1!A49)","v":30},{"$f":"IF(ISBLANK(Sheet1!B49),\" \",Sheet1!B49)","v":" "},{"$f":"IF(ISBLANK(Sheet1!C49),\" \",Sheet1!C49)","v":" "},{"$f":"IF(CCA_Form_A_Part_I!I38=0,\" \",CCA_Form_A_Part_I!I38)","v":" "},{"$f":"IF(CCA_Form_A_Part_I!O38=0,\" \",CCA_Form_A_Part_I!O38)","v":" "},{"$f":"IF(CCA_Form_A_Part_I!U38=0,\" \",CCA_Form_A_Part_I!U38)","v":" "},{"v":0,"d":"0.00"}]
[{"$f":"IF(ISBLANK(Sheet1!A50),\" \",Sheet1!A50)","v":31},{"$f":"IF(ISBLANK(Sheet1!B50),\" \",Sheet1!B50)","v":" "},{"$f":"IF(ISBLANK(Sheet1!C50),\" \",Sheet1!C50)","v":" "},{"$f":"IF(CCA_Form_A_Part_I!I39=0,\" \",CCA_Form_A_Part_I!I39)","v":" "},{"$f":"IF(CCA_Form_A_Part_I!O39=0,\" \",CCA_Form_A_Part_I!O39)","v":" "},{"$f":"IF(CCA_Form_A_Part_I!U39=0,\" \",CCA_Form_A_Part_I!U39)","v":" "},{"v":0,"d":"0.00"}]
[{"$f":"IF(ISBLANK(Sheet1!A51),\" \",Sheet1!A51)","v":32},{"$f":"IF(ISBLANK(Sheet1!B51),\" \",Sheet1!B51)","v":" "},{"$f":"IF(ISBLANK(Sheet1!C51),\" \",Sheet1!C51)","v":" "},{"$f":"IF(CCA_Form_A_Part_I!I40=0,\" \",CCA_Form_A_Part_I!I40)","v":" "},{"$f":"IF(CCA_Form_A_Part_I!O40=0,\" \",CCA_Form_A_Part_I!O40)","v":" "},{"$f":"IF(CCA_Form_A_Part_I!U40=0,\" \",CCA_Form_A_Part_I!U40)","v":" "},{"v":0,"d":"0.00"}]
[{"$f":"IF(ISBLANK(Sheet1!A52),\" \",Sheet1!A52)","v":33},{"$f":"IF(ISBLANK(Sheet1!B52),\" \",Sheet1!B52)","v":" "},{"$f":"IF(ISBLANK(Sheet1!C52),\" \",Sheet1!C52)","v":" "},{"$f":"IF(CCA_Form_A_Part_I!I41=0,\" \",CCA_Form_A_Part_I!I41)","v":" "},{"$f":"IF(CCA_Form_A_Part_I!O41=0,\" \",CCA_Form_A_Part_I!O41)","v":" "},{"$f":"IF(CCA_Form_A_Part_I!U41=0,\" \",CCA_Form_A_Part_I!U41)","v":" "},{"v":0,"d":"0.00"}]
[{"$f":"IF(ISBLANK(Sheet1!A53),\" \",Sheet1!A53)","v":34},{"$f":"IF(ISBLANK(Sheet1!B53),\" \",Sheet1!B53)","v":" "},{"$f":"IF(ISBLANK(Sheet1!C53),\" \",Sheet1!C53)","v":" "},{"$f":"IF(CCA_Form_A_Part_I!I42=0,\" \",CCA_Form_A_Part_I!I42)","v":" "},{"$f":"IF(CCA_Form_A_Part_I!O42=0,\" \",CCA_Form_A_Part_I!O42)","v":" "},{"$f":"IF(CCA_Form_A_Part_I!U42=0,\" \",CCA_Form_A_Part_I!U42)","v":" "},{"v":0,"d":"0.00"}]
[{"$f":"IF(ISBLANK(Sheet1!A54),\" \",Sheet1!A54)","v":35},{"$f":"IF(ISBLANK(Sheet1!B54),\" \",Sheet1!B54)","v":" "},{"$f":"IF(ISBLANK(Sheet1!C54),\" \",Sheet1!C54)","v":" "},{"$f":"IF(CCA_Form_A_Part_I!I43=0,\" \",CCA_Form_A_Part_I!I43)","v":" "},{"$f":"IF(CCA_Form_A_Part_I!O43=0,\" \",CCA_Form_A_Part_I!O43)","v":" "},{"$f":"IF(CCA_Form_A_Part_I!U43=0,\" \",CCA_Form_A_Part_I!U43)","v":" "},{"v":0,"d":"0.00"}]
[]
["Certified that,"]
["(1) The entries are verified with the records and there is no error or omission."]
["(2) These assessments were published and no grievances are pending."]
["(3) No error(s) is/are shown in the CCA Form A Part I and CCA Form A Part II."]
[]
[]
[]
[]
["Course Faculty/Course Coordinator",null,null,"HoD",{"$nulls":3},"Principal"]

{"sheet":"CCA Form A Part II (4)","index":6,"n_rows":54,"n_cols":8,"rows_kept":54,"hidden":true,"merged":[[0,0,0,9],[1,1,1,2],[2,1,2,2],[2,4,2,5],[2,6,2,8],[3,1,3,2],[3,4,3,5],[3,6,3,8],[4,0,4,1],[4,6,4,9],[5,5,6,5],[46,0,46,3],[47,0,47,3],[48,0,48,3],[53,0,53,2],[53,3,53,4],[53,7,53,9]]}
["ST. JOSEPH'S COLLEGE, MOOLAMATTOM (AUTONOMOUS)"]
["Academic Year",{"$f":"Sheet1!D2","v":"2024-2025"}]
["Course Code:",{"$f":"Sheet1!D3","v":"MG1DSCMA101"},null,null,"Name of the Course:",null,{"$f":"Sheet1!D6","v":"INTRODUCTION TO WEB DESIGNING\t\t"}]
["Semester:",{"$f":"Sheet1!D4","v":1},null,null,"Number of Course Outcomes:",null,{"$f":"Sheet1!D7","v":9}]
["CCA Component Type (Theory/Practical):",null,{"$f":"Sheet1!D5","v":"THEORY"}]
["CO Number","CO 1","CO 2","CO 3","CO 4","Total Marks Allocated for CCA"]
["Evaluation Method(s) Used",{"$f":"Sheet1!A11&CHAR(10)&Sheet1!A12&CHAR(10)&Sheet1!A13&CHAR(10)&Sheet1!A14&CHAR(10)&Sheet1!A15","v":"\n\n\n\n"},{"$f":"Sheet1!D11&CHAR(10)&Sheet1!D12&CHAR(10)&Sheet1!D13&CHAR(10)&Sheet1!D14&CHAR(10)&Sheet1!D15","v":"\n\n\n\n"},{"$f":"Sheet1!G11&CHAR(10)&Sheet1!G12&CHAR(10)&Sheet1!G13&CHAR(10)&Sheet1!G14&CHAR(10)&Sheet1!G15","v":"\n\n\n\n"},{"$f":"Sheet1!J11&CHAR(10)&Sheet1!J12&CHAR(10)&Sheet1!J13&CHAR(10)&Sheet1!J14&CHAR(10)&Sheet1!J15","v":"\n\n\n\n"}]
["Maximum Marks Allocated",{"$f":"Sheet1!C16","v":0},{"$f":"Sheet1!F16","v":0},{"$f":"Sheet1!I16","v":0},{"$f":"Sheet1!L16","v":0},{"$f":"Sheet1!D8","v":0}]
["SL. No.","Register Number","Name of the Student","Marks Obtained in CO 1","Marks Obtained in CO 2","Marks Obtained in CO 3","Marks Obtained in CO 4","Total Marks Obtained in CCA"]
[{"$f":"IF(ISBLANK(Sheet1!A20),\" \",Sheet1!A20)","v":1},{"$f":"IF(ISBLANK(Sheet1!B20),\" \",Sheet1!B20)","v":" "},{"$f":"Sheet1!C20","v":0},{"$f":"IF(CCA_Form_A_Part_I!I9=0,\" \",CCA_Form_A_Part_I!I9)","v":" "},{"$f":"IF(CCA_Form_A_Part_I!O9=0,\" \",CCA_Form_A_Part_I!O9)","v":" "},{"$f":"IF(CCA_Form_A_Part_I!U9=0,\" \",CCA_Form_A_Part_I!U9)","v":" "},{"$f":"IF(CCA_Form_A_Part_I!AA9=0,\" \",CCA_Form_A_Part_I!AA9)","v":" "},{"$f":"SUM(D10:G10)","v":{"v":0,"d":"0.00"}}]
[{"$f":"IF(ISBLANK(Sheet1!A21),\" \",Sheet1!A21)","v":2},{"$f":"IF(ISBLANK(Sheet1!B21),\" \",Sheet1!B21)","v":" "},{"$f":"IF(ISBLANK(Sheet1!C21),\" \",Sheet1!C21)","v":" "},{"$f":"IF(CCA_Form_A_Part_I!I10=0,\" \",CCA_Form_A_Part_I!I10)","v":" "},{"$f":"IF(CCA_Form_A_Part_I!O10=0,\" \",CCA_Form_A_Part_I!O10)","v":" "},{"$f":"IF(CCA_Form_A_Part_I!U10=0,\" \",CCA_Form_A_Part_I!U10)","v":" "},{"$f":"IF(CCA_Form_A_Part_I!AA10=0,\" \",CCA_Form_A_Part_I!AA10)","v":" "},{"$f":"SUM(D11:G11)","v":{"v":0,"d":"0.00"}}]
[{"$f":"IF(ISBLANK(Sheet1!A22),\" \",Sheet1!A22)","v":3},{"$f":"IF(ISBLANK(Sheet1!B22),\" \",Sheet1!B22)","v":" "},{"$f":"IF(ISBLANK(Sheet1!C22),\" \",Sheet1!C22)","v":" "},{"$f":"IF(CCA_Form_A_Part_I!I11=0,\" \",CCA_Form_A_Part_I!I11)","v":" "},{"$f":"IF(CCA_Form_A_Part_I!O11=0,\" \",CCA_Form_A_Part_I!O11)","v":" "},{"$f":"IF(CCA_Form_A_Part_I!U11=0,\" \",CCA_Form_A_Part_I!U11)","v":" "},{"$f":"IF(CCA_Form_A_Part_I!AA11=0,\" \",CCA_Form_A_Part_I!AA11)","v":" "},{"v":0,"d":"0.00"}]
[{"$f":"IF(ISBLANK(Sheet1!A23),\" \",Sheet1!A23)","v":4},{"$f":"IF(ISBLANK(Sheet1!B23),\" \",Sheet1!B23)","v":" "},{"$f":"IF(ISBLANK(Sheet1!C23),\" \",Sheet1!C23)","v":" "},{"$f":"IF(CCA_Form_A_Part_I!I12=0,\" \",CCA_Form_A_Part_I!I12)","v":" "},{"$f":"IF(CCA_Form_A_Part_I!O12=0,\" \",CCA_Form_A_Part_I!O12)","v":" "},{"$f":"IF(CCA_Form_A_Part_I!U12=0,\" \",CCA_Form_A_Part_I!U12)","v":" "},{"$f":"IF(CCA_Form_A_Part_I!AA12=0,\" \",CCA_Form_A_Part_I!AA12)","v":" "},{"v":0,"d":"0.00"}]
[{"$f":"IF(ISBLANK(Sheet1!A24),\" \",Sheet1!A24)","v":5},{"$f":"IF(ISBLANK(Sheet1!B24),\" \",Sheet1!B24)","v":" "},{"$f":"IF(ISBLANK(Sheet1!C24),\" \",Sheet1!C24)","v":" "},{"$f":"IF(CCA_Form_A_Part_I!I13=0,\" \",CCA_Form_A_Part_I!I13)","v":" "},{"$f":"IF(CCA_Form_A_Part_I!O13=0,\" \",CCA_Form_A_Part_I!O13)","v":" "},{"$f":"IF(CCA_Form_A_Part_I!U13=0,\" \",CCA_Form_A_Part_I!U13)","v":" "},{"$f":"IF(CCA_Form_A_Part_I!AA13=0,\" \",CCA_Form_A_Part_I!AA13)","v":" "},{"v":0,"d":"0.00"}]
[{"$f":"IF(ISBLANK(Sheet1!A25),\" \",Sheet1!A25)","v":6},{"$f":"IF(ISBLANK(Sheet1!B25),\" \",Sheet1!B25)","v":" "},{"$f":"IF(ISBLANK(Sheet1!C25),\" \",Sheet1!C25)","v":" "},{"$f":"IF(CCA_Form_A_Part_I!I14=0,\" \",CCA_Form_A_Part_I!I14)","v":" "},{"$f":"IF(CCA_Form_A_Part_I!O14=0,\" \",CCA_Form_A_Part_I!O14)","v":" "},{"$f":"IF(CCA_Form_A_Part_I!U14=0,\" \",CCA_Form_A_Part_I!U14)","v":" "},{"$f":"IF(CCA_Form_A_Part_I!AA14=0,\" \",CCA_Form_A_Part_I!AA14)","v":" "},{"v":0,"d":"0.00"}]
[{"$f":"IF(ISBLANK(Sheet1!A26),\" \",Sheet1!A26)","v":7},{"$f":"IF(ISBLANK(Sheet1!B26),\" \",Sheet1!B26)","v":" "},{"$f":"IF(ISBLANK(Sheet1!C26),\" \",Sheet1!C26)","v":" "},{"$f":"IF(CCA_Form_A_Part_I!I15=0,\" \",CCA_Form_A_Part_I!I15)","v":" "},{"$f":"IF(CCA_Form_A_Part_I!O15=0,\" \",CCA_Form_A_Part_I!O15)","v":" "},{"$f":"IF(CCA_Form_A_Part_I!U15=0,\" \",CCA_Form_A_Part_I!U15)","v":" "},{"$f":"IF(CCA_Form_A_Part_I!AA15=0,\" \",CCA_Form_A_Part_I!AA15)","v":" "},{"v":0,"d":"0.00"}]
[{"$f":"IF(ISBLANK(Sheet1!A27),\" \",Sheet1!A27)","v":8},{"$f":"IF(ISBLANK(Sheet1!B27),\" \",Sheet1!B27)","v":" "},{"$f":"IF(ISBLANK(Sheet1!C27),\" \",Sheet1!C27)","v":" "},{"$f":"IF(CCA_Form_A_Part_I!I16=0,\" \",CCA_Form_A_Part_I!I16)","v":" "},{"$f":"IF(CCA_Form_A_Part_I!O16=0,\" \",CCA_Form_A_Part_I!O16)","v":" "},{"$f":"IF(CCA_Form_A_Part_I!U16=0,\" \",CCA_Form_A_Part_I!U16)","v":" "},{"$f":"IF(CCA_Form_A_Part_I!AA16=0,\" \",CCA_Form_A_Part_I!AA16)","v":" "},{"v":0,"d":"0.00"}]
[{"$f":"IF(ISBLANK(Sheet1!A28),\" \",Sheet1!A28)","v":9},{"$f":"IF(ISBLANK(Sheet1!B28),\" \",Sheet1!B28)","v":" "},{"$f":"IF(ISBLANK(Sheet1!C28),\" \",Sheet1!C28)","v":" "},{"$f":"IF(CCA_Form_A_Part_I!I17=0,\" \",CCA_Form_A_Part_I!I17)","v":" "},{"$f":"IF(CCA_Form_A_Part_I!O17=0,\" \",CCA_Form_A_Part_I!O17)","v":" "},{"$f":"IF(CCA_Form_A_Part_I!U17=0,\" \",CCA_Form_A_Part_I!U17)","v":" "},{"$f":"IF(CCA_Form_A_Part_I!AA17=0,\" \",CCA_Form_A_Part_I!AA17)","v":" "},{"v":0,"d":"0.00"}]
[{"$f":"IF(ISBLANK(Sheet1!A29),\" \",Sheet1!A29)","v":10},{"$f":"IF(ISBLANK(Sheet1!B29),\" \",Sheet1!B29)","v":" "},{"$f":"IF(ISBLANK(Sheet1!C29),\" \",Sheet1!C29)","v":" "},{"$f":"IF(CCA_Form_A_Part_I!I18=0,\" \",CCA_Form_A_Part_I!I18)","v":" "},{"$f":"IF(CCA_Form_A_Part_I!O18=0,\" \",CCA_Form_A_Part_I!O18)","v":" "},{"$f":"IF(CCA_Form_A_Part_I!U18=0,\" \",CCA_Form_A_Part_I!U18)","v":" "},{"$f":"IF(CCA_Form_A_Part_I!AA18=0,\" \",CCA_Form_A_Part_I!AA18)","v":" "},{"v":0,"d":"0.00"}]
[{"$f":"IF(ISBLANK(Sheet1!A30),\" \",Sheet1!A30)","v":11},{"$f":"IF(ISBLANK(Sheet1!B30),\" \",Sheet1!B30)","v":" "},{"$f":"IF(ISBLANK(Sheet1!C30),\" \",Sheet1!C30)","v":" "},{"$f":"IF(CCA_Form_A_Part_I!I19=0,\" \",CCA_Form_A_Part_I!I19)","v":" "},{"$f":"IF(CCA_Form_A_Part_I!O19=0,\" \",CCA_Form_A_Part_I!O19)","v":" "},{"$f":"IF(CCA_Form_A_Part_I!U19=0,\" \",CCA_Form_A_Part_I!U19)","v":" "},{"$f":"IF(CCA_Form_A_Part_I!AA19=0,\" \",CCA_Form_A_Part_I!AA19)","v":" "},{"v":0,"d":"0.00"}]
[{"$f":"IF(ISBLANK(Sheet1!A31),\" \",Sheet1!A31)","v":12},{"$f":"IF(ISBLANK(Sheet1!B31),\" \",Sheet1!B31)","v":" "},{"$f":"IF(ISBLANK(Sheet1!C31),\" \",Sheet1!C31)","v":" "},{"$f":"IF(CCA_Form_A_Part_I!I20=0,\" \",CCA_Form_A_Part_I!I20)","v":" "},{"$f":"IF(CCA_Form_A_Part_I!O20=0,\" \",CCA_Form_A_Part_I!O20)","v":" "},{"$f":"IF(CCA_Form_A_Part_I!U20=0,\" \",CCA_Form_A_Part_I!U20)","v":" "},{"$f":"IF(CCA_Form_A_Part_I!AA20=0,\" \",CCA_Form_A_Part_I!AA20)","v":" "},{"v":0,"d":"0.00"}]
[{"$f":"IF(ISBLANK(Sheet1!A32),\" \",Sheet1!A32)","v":13},{"$f":"IF(ISBLANK(Sheet1!B32),\" \",Sheet1!B32)","v":" "},{"$f":"IF(ISBLANK(Sheet1!C32),\" \",Sheet1!C32)","v":" "},{"$f":"IF(CCA_Form_A_Part_I!I21=0,\" \",CCA_Form_A_Part_I!I21)","v":" "},{"$f":"IF(CCA_Form_A_Part_I!O21=0,\" \",CCA_Form_A_Part_I!O21)","v":" "},{"$f":"IF(CCA_Form_A_Part_I!U21=0,\" \",CCA_Form_A_Part_I!U21)","v":" "},{"$f":"IF(CCA_Form_A_Part_I!AA21=0,\" \",CCA_Form_A_Part_I!AA21)","v":" "},{"v":0,"d":"0.00"}]
[{"$f":"IF(ISBLANK(Sheet1!A33),\" \",Sheet1!A33)","v":14},{"$f":"IF(ISBLANK(Sheet1!B33),\" \",Sheet1!B33)","v":" "},{"$f":"IF(ISBLANK(Sheet1!C33),\" \",Sheet1!C33)","v":" "},{"$f":"IF(CCA_Form_A_Part_I!I22=0,\" \",CCA_Form_A_Part_I!I22)","v":" "},{"$f":"IF(CCA_Form_A_Part_I!O22=0,\" \",CCA_Form_A_Part_I!O22)","v":" "},{"$f":"IF(CCA_Form_A_Part_I!U22=0,\" \",CCA_Form_A_Part_I!U22)","v":" "},{"$f":"IF(CCA_Form_A_Part_I!AA22=0,\" \",CCA_Form_A_Part_I!AA22)","v":" "},{"v":0,"d":"0.00"}]
[{"$f":"IF(ISBLANK(Sheet1!A34),\" \",Sheet1!A34)","v":15},{"$f":"IF(ISBLANK(Sheet1!B34),\" \",Sheet1!B34)","v":" "},{"$f":"IF(ISBLANK(Sheet1!C34),\" \",Sheet1!C34)","v":" "},{"$f":"IF(CCA_Form_A_Part_I!I23=0,\" \",CCA_Form_A_Part_I!I23)","v":" "},{"$f":"IF(CCA_Form_A_Part_I!O23=0,\" \",CCA_Form_A_Part_I!O23)","v":" "},{"$f":"IF(CCA_Form_A_Part_I!U23=0,\" \",CCA_Form_A_Part_I!U23)","v":" "},{"$f":"IF(CCA_Form_A_Part_I!AA23=0,\" \",CCA_Form_A_Part_I!AA23)","v":" "},{"v":0,"d":"0.00"}]
[{"$f":"IF(ISBLANK(Sheet1!A35),\" \",Sheet1!A35)","v":16},{"$f":"IF(ISBLANK(Sheet1!B35),\" \",Sheet1!B35)","v":" "},{"$f":"IF(ISBLANK(Sheet1!C35),\" \",Sheet1!C35)","v":" "},{"$f":"IF(CCA_Form_A_Part_I!I24=0,\" \",CCA_Form_A_Part_I!I24)","v":" "},{"$f":"IF(CCA_Form_A_Part_I!O24=0,\" \",CCA_Form_A_Part_I!O24)","v":" "},{"$f":"IF(CCA_Form_A_Part_I!U24=0,\" \",CCA_Form_A_Part_I!U24)","v":" "},{"$f":"IF(CCA_Form_A_Part_I!AA24=0,\" \",CCA_Form_A_Part_I!AA24)","v":" "},{"v":0,"d":"0.00"}]
[{"$f":"IF(ISBLANK(Sheet1!A36),\" \",Sheet1!A36)","v":17},{"$f":"IF(ISBLANK(Sheet1!B36),\" \",Sheet1!B36)","v":" "},{"$f":"IF(ISBLANK(Sheet1!C36),\" \",Sheet1!C36)","v":" "},{"$f":"IF(CCA_Form_A_Part_I!I25=0,\" \",CCA_Form_A_Part_I!I25)","v":" "},{"$f":"IF(CCA_Form_A_Part_I!O25=0,\" \",CCA_Form_A_Part_I!O25)","v":" "},{"$f":"IF(CCA_Form_A_Part_I!U25=0,\" \",CCA_Form_A_Part_I!U25)","v":" "},{"$f":"IF(CCA_Form_A_Part_I!AA25=0,\" \",CCA_Form_A_Part_I!AA25)","v":" "},{"v":0,"d":"0.00"}]
[{"$f":"IF(ISBLANK(Sheet1!A37),\" \",Sheet1!A37)","v":18},{"$f":"IF(ISBLANK(Sheet1!B37),\" \",Sheet1!B37)","v":" "},{"$f":"IF(ISBLANK(Sheet1!C37),\" \",Sheet1!C37)","v":" "},{"$f":"IF(CCA_Form_A_Part_I!I26=0,\" \",CCA_Form_A_Part_I!I26)","v":" "},{"$f":"IF(CCA_Form_A_Part_I!O26=0,\" \",CCA_Form_A_Part_I!O26)","v":" "},{"$f":"IF(CCA_Form_A_Part_I!U26=0,\" \",CCA_Form_A_Part_I!U26)","v":" "},{"$f":"IF(CCA_Form_A_Part_I!AA26=0,\" \",CCA_Form_A_Part_I!AA26)","v":" "},{"v":0,"d":"0.00"}]
[{"$f":"IF(ISBLANK(Sheet1!A38),\" \",Sheet1!A38)","v":19},{"$f":"IF(ISBLANK(Sheet1!B38),\" \",Sheet1!B38)","v":" "},{"$f":"IF(ISBLANK(Sheet1!C38),\" \",Sheet1!C38)","v":" "},{"$f":"IF(CCA_Form_A_Part_I!I27=0,\" \",CCA_Form_A_Part_I!I27)","v":" "},{"$f":"IF(CCA_Form_A_Part_I!O27=0,\" \",CCA_Form_A_Part_I!O27)","v":" "},{"$f":"IF(CCA_Form_A_Part_I!U27=0,\" \",CCA_Form_A_Part_I!U27)","v":" "},{"$f":"IF(CCA_Form_A_Part_I!AA27=0,\" \",CCA_Form_A_Part_I!AA27)","v":" "},{"v":0,"d":"0.00"}]
[{"$f":"IF(ISBLANK(Sheet1!A39),\" \",Sheet1!A39)","v":20},{"$f":"IF(ISBLANK(Sheet1!B39),\" \",Sheet1!B39)","v":" "},{"$f":"IF(ISBLANK(Sheet1!C39),\" \",Sheet1!C39)","v":" "},{"$f":"IF(CCA_Form_A_Part_I!I28=0,\" \",CCA_Form_A_Part_I!I28)","v":" "},{"$f":"IF(CCA_Form_A_Part_I!O28=0,\" \",CCA_Form_A_Part_I!O28)","v":" "},{"$f":"IF(CCA_Form_A_Part_I!U28=0,\" \",CCA_Form_A_Part_I!U28)","v":" "},{"$f":"IF(CCA_Form_A_Part_I!AA28=0,\" \",CCA_Form_A_Part_I!AA28)","v":" "},{"v":0,"d":"0.00"}]
[{"$f":"IF(ISBLANK(Sheet1!A40),\" \",Sheet1!A40)","v":21},{"$f":"IF(ISBLANK(Sheet1!B40),\" \",Sheet1!B40)","v":" "},{"$f":"IF(ISBLANK(Sheet1!C40),\" \",Sheet1!C40)","v":" "},{"$f":"IF(CCA_Form_A_Part_I!I29=0,\" \",CCA_Form_A_Part_I!I29)","v":" "},{"$f":"IF(CCA_Form_A_Part_I!O29=0,\" \",CCA_Form_A_Part_I!O29)","v":" "},{"$f":"IF(CCA_Form_A_Part_I!U29=0,\" \",CCA_Form_A_Part_I!U29)","v":" "},{"$f":"IF(CCA_Form_A_Part_I!AA29=0,\" \",CCA_Form_A_Part_I!AA29)","v":" "},{"v":0,"d":"0.00"}]
[{"$f":"IF(ISBLANK(Sheet1!A41),\" \",Sheet1!A41)","v":22},{"$f":"IF(ISBLANK(Sheet1!B41),\" \",Sheet1!B41)","v":" "},{"$f":"IF(ISBLANK(Sheet1!C41),\" \",Sheet1!C41)","v":" "},{"$f":"IF(CCA_Form_A_Part_I!I30=0,\" \",CCA_Form_A_Part_I!I30)","v":" "},{"$f":"IF(CCA_Form_A_Part_I!O30=0,\" \",CCA_Form_A_Part_I!O30)","v":" "},{"$f":"IF(CCA_Form_A_Part_I!U30=0,\" \",CCA_Form_A_Part_I!U30)","v":" "},{"$f":"IF(CCA_Form_A_Part_I!AA30=0,\" \",CCA_Form_A_Part_I!AA30)","v":" "},{"v":0,"d":"0.00"}]
[{"$f":"IF(ISBLANK(Sheet1!A42),\" \",Sheet1!A42)","v":23},{"$f":"IF(ISBLANK(Sheet1!B42),\" \",Sheet1!B42)","v":" "},{"$f":"IF(ISBLANK(Sheet1!C42),\" \",Sheet1!C42)","v":" "},{"$f":"IF(CCA_Form_A_Part_I!I31=0,\" \",CCA_Form_A_Part_I!I31)","v":" "},{"$f":"IF(CCA_Form_A_Part_I!O31=0,\" \",CCA_Form_A_Part_I!O31)","v":" "},{"$f":"IF(CCA_Form_A_Part_I!U31=0,\" \",CCA_Form_A_Part_I!U31)","v":" "},{"$f":"IF(CCA_Form_A_Part_I!AA31=0,\" \",CCA_Form_A_Part_I!AA31)","v":" "},{"v":0,"d":"0.00"}]
[{"$f":"IF(ISBLANK(Sheet1!A43),\" \",Sheet1!A43)","v":24},{"$f":"IF(ISBLANK(Sheet1!B43),\" \",Sheet1!B43)","v":" "},{"$f":"IF(ISBLANK(Sheet1!C43),\" \",Sheet1!C43)","v":" "},{"$f":"IF(CCA_Form_A_Part_I!I32=0,\" \",CCA_Form_A_Part_I!I32)","v":" "},{"$f":"IF(CCA_Form_A_Part_I!O32=0,\" \",CCA_Form_A_Part_I!O32)","v":" "},{"$f":"IF(CCA_Form_A_Part_I!U32=0,\" \",CCA_Form_A_Part_I!U32)","v":" "},{"$f":"IF(CCA_Form_A_Part_I!AA32=0,\" \",CCA_Form_A_Part_I!AA32)","v":" "},{"v":0,"d":"0.00"}]
[{"$f":"IF(ISBLANK(Sheet1!A44),\" \",Sheet1!A44)","v":25},{"$f":"IF(ISBLANK(Sheet1!B44),\" \",Sheet1!B44)","v":" "},{"$f":"IF(ISBLANK(Sheet1!C44),\" \",Sheet1!C44)","v":" "},{"$f":"IF(CCA_Form_A_Part_I!I33=0,\" \",CCA_Form_A_Part_I!I33)","v":" "},{"$f":"IF(CCA_Form_A_Part_I!O33=0,\" \",CCA_Form_A_Part_I!O33)","v":" "},{"$f":"IF(CCA_Form_A_Part_I!U33=0,\" \",CCA_Form_A_Part_I!U33)","v":" "},{"$f":"IF(CCA_Form_A_Part_I!AA33=0,\" \",CCA_Form_A_Part_I!AA33)","v":" "},{"v":0,"d":"0.00"}]
[{"$f":"IF(ISBLANK(Sheet1!A45),\" \",Sheet1!A45)","v":26},{"$f":"IF(ISBLANK(Sheet1!B45),\" \",Sheet1!B45)","v":" "},{"$f":"IF(ISBLANK(Sheet1!C45),\" \",Sheet1!C45)","v":" "},{"$f":"IF(CCA_Form_A_Part_I!I34=0,\" \",CCA_Form_A_Part_I!I34)","v":" "},{"$f":"IF(CCA_Form_A_Part_I!O34=0,\" \",CCA_Form_A_Part_I!O34)","v":" "},{"$f":"IF(CCA_Form_A_Part_I!U34=0,\" \",CCA_Form_A_Part_I!U34)","v":" "},{"$f":"IF(CCA_Form_A_Part_I!AA34=0,\" \",CCA_Form_A_Part_I!AA34)","v":" "},{"v":0,"d":"0.00"}]
[{"$f":"IF(ISBLANK(Sheet1!A46),\" \",Sheet1!A46)","v":27},{"$f":"IF(ISBLANK(Sheet1!B46),\" \",Sheet1!B46)","v":" "},{"$f":"IF(ISBLANK(Sheet1!C46),\" \",Sheet1!C46)","v":" "},{"$f":"IF(CCA_Form_A_Part_I!I35=0,\" \",CCA_Form_A_Part_I!I35)","v":" "},{"$f":"IF(CCA_Form_A_Part_I!O35=0,\" \",CCA_Form_A_Part_I!O35)","v":" "},{"$f":"IF(CCA_Form_A_Part_I!U35=0,\" \",CCA_Form_A_Part_I!U35)","v":" "},{"$f":"IF(CCA_Form_A_Part_I!AA35=0,\" \",CCA_Form_A_Part_I!AA35)","v":" "},{"v":0,"d":"0.00"}]
[{"$f":"IF(ISBLANK(Sheet1!A47),\" \",Sheet1!A47)","v":28},{"$f":"IF(ISBLANK(Sheet1!B47),\" \",Sheet1!B47)","v":" "},{"$f":"IF(ISBLANK(Sheet1!C47),\" \",Sheet1!C47)","v":" "},{"$f":"IF(CCA_Form_A_Part_I!I36=0,\" \",CCA_Form_A_Part_I!I36)","v":" "},{"$f":"IF(CCA_Form_A_Part_I!O36=0,\" \",CCA_Form_A_Part_I!O36)","v":" "},{"$f":"IF(CCA_Form_A_Part_I!U36=0,\" \",CCA_Form_A_Part_I!U36)","v":" "},{"$f":"IF(CCA_Form_A_Part_I!AA36=0,\" \",CCA_Form_A_Part_I!AA36)","v":" "},{"v":0,"d":"0.00"}]
[{"$f":"IF(ISBLANK(Sheet1!A48),\" \",Sheet1!A48)","v":29},{"$f":"IF(ISBLANK(Sheet1!B48),\" \",Sheet1!B48)","v":" "},{"$f":"IF(ISBLANK(Sheet1!C48),\" \",Sheet1!C48)","v":" "},{"$f":"IF(CCA_Form_A_Part_I!I37=0,\" \",CCA_Form_A_Part_I!I37)","v":" "},{"$f":"IF(CCA_Form_A_Part_I!O37=0,\" \",CCA_Form_A_Part_I!O37)","v":" "},{"$f":"IF(CCA_Form_A_Part_I!U37=0,\" \",CCA_Form_A_Part_I!U37)","v":" "},{"$f":"IF(CCA_Form_A_Part_I!AA37=0,\" \",CCA_Form_A_Part_I!AA37)","v":" "},{"v":0,"d":"0.00"}]
[{"$f":"IF(ISBLANK(Sheet1!A49),\" \",Sheet1!A49)","v":30},{"$f":"IF(ISBLANK(Sheet1!B49),\" \",Sheet1!B49)","v":" "},{"$f":"IF(ISBLANK(Sheet1!C49),\" \",Sheet1!C49)","v":" "},{"$f":"IF(CCA_Form_A_Part_I!I38=0,\" \",CCA_Form_A_Part_I!I38)","v":" "},{"$f":"IF(CCA_Form_A_Part_I!O38=0,\" \",CCA_Form_A_Part_I!O38)","v":" "},{"$f":"IF(CCA_Form_A_Part_I!U38=0,\" \",CCA_Form_A_Part_I!U38)","v":" "},{"$f":"IF(CCA_Form_A_Part_I!AA38=0,\" \",CCA_Form_A_Part_I!AA38)","v":" "},{"v":0,"d":"0.00"}]
[{"$f":"IF(ISBLANK(Sheet1!A50),\" \",Sheet1!A50)","v":31},{"$f":"IF(ISBLANK(Sheet1!B50),\" \",Sheet1!B50)","v":" "},{"$f":"IF(ISBLANK(Sheet1!C50),\" \",Sheet1!C50)","v":" "},{"$f":"IF(CCA_Form_A_Part_I!I39=0,\" \",CCA_Form_A_Part_I!I39)","v":" "},{"$f":"IF(CCA_Form_A_Part_I!O39=0,\" \",CCA_Form_A_Part_I!O39)","v":" "},{"$f":"IF(CCA_Form_A_Part_I!U39=0,\" \",CCA_Form_A_Part_I!U39)","v":" "},{"$f":"IF(CCA_Form_A_Part_I!AA39=0,\" \",CCA_Form_A_Part_I!AA39)","v":" "},{"v":0,"d":"0.00"}]
[{"$f":"IF(ISBLANK(Sheet1!A51),\" \",Sheet1!A51)","v":32},{"$f":"IF(ISBLANK(Sheet1!B51),\" \",Sheet1!B51)","v":" "},{"$f":"IF(ISBLANK(Sheet1!C51),\" \",Sheet1!C51)","v":" "},{"$f":"IF(CCA_Form_A_Part_I!I40=0,\" \",CCA_Form_A_Part_I!I40)","v":" "},{"$f":"IF(CCA_Form_A_Part_I!O40=0,\" \",CCA_Form_A_Part_I!O40)","v":" "},{"$f":"IF(CCA_Form_A_Part_I!U40=0,\" \",CCA_Form_A_Part_I!U40)","v":" "},{"$f":"IF(CCA_Form_A_Part_I!AA40=0,\" \",CCA_Form_A_Part_I!AA40)","v":" "},{"v":0,"d":"0.00"}]
[{"$f":"IF(ISBLANK(Sheet1!A52),\" \",Sheet1!A52)","v":33},{"$f":"IF(ISBLANK(Sheet1!B52),\" \",Sheet1!B52)","v":" "},{"$f":"IF(ISBLANK(Sheet1!C52),\" \",Sheet1!C52)","v":" "},{"$f":"IF(CCA_Form_A_Part_I!I41=0,\" \",CCA_Form_A_Part_I!I41)","v":" "},{"$f":"IF(CCA_Form_A_Part_I!O41=0,\" \",CCA_Form_A_Part_I!O41)","v":" "},{"$f":"IF(CCA_Form_A_Part_I!U41=0,\" \",CCA_Form_A_Part_I!U41)","v":" "},{"$f":"IF(CCA_Form_A_Part_I!AA41=0,\" \",CCA_Form_A_Part_I!AA41)","v":" "},{"v":0,"d":"0.00"}]
[{"$f":"IF(ISBLANK(Sheet1!A53),\" \",Sheet1!A53)","v":34},{"$f":"IF(ISBLANK(Sheet1!B53),\" \",Sheet1!B53)","v":" "},{"$f":"IF(ISBLANK(Sheet1!C53),\" \",Sheet1!C53)","v":" "},{"$f":"IF(CCA_Form_A_Part_I!I42=0,\" \",CCA_Form_A_Part_I!I42)","v":" "},{"$f":"IF(CCA_Form_A_Part_I!O42=0,\" \",CCA_Form_A_Part_I!O42)","v":" "},{"$f":"IF(CCA_Form_A_Part_I!U42=0,\" \",CCA_Form_A_Part_I!U42)","v":" "},{"$f":"IF(CCA_Form_A_Part_I!AA42=0,\" \",CCA_Form_A_Part_I!AA42)","v":" "},{"v":0,"d":"0.00"}]
[{"$f":"IF(ISBLANK(Sheet1!A54),\" \",Sheet1!A54)","v":35},{"$f":"IF(ISBLANK(Sheet1!B54),\" \",Sheet1!B54)","v":" "},{"$f":"IF(ISBLANK(Sheet1!C54),\" \",Sheet1!C54)","v":" "},{"$f":"IF(CCA_Form_A_Part_I!I43=0,\" \",CCA_Form_A_Part_I!I43)","v":" "},{"$f":"IF(CCA_Form_A_Part_I!O43=0,\" \",CCA_Form_A_Part_I!O43)","v":" "},{"$f":"IF(CCA_Form_A_Part_I!U43=0,\" \",CCA_Form_A_Part_I!U43)","v":" "},{"$f":"IF(CCA_Form_A_Part_I!AA43=0,\" \",CCA_Form_A_Part_I!AA43)","v":" "},{"v":0,"d":"0.00"}]
[]
["Certified that,"]
["(1) The entries are verified with the records and there is no error or omission."]
["(2) These assessments were published and no grievances are pending."]
["(3) No error(s) is/are shown in the CCA Form A Part I and CCA Form A Part II."]
[]
[]
[]
[]
["Course Faculty/Course Coordinator",null,null,"HoD",{"$nulls":3},"Principal"]

{"sheet":"CCA Form A Part II (5)","index":7,"n_rows":54,"n_cols":9,"rows_kept":54,"hidden":true,"merged":[[0,0,0,9],[1,1,1,2],[2,1,2,2],[2,4,2,5],[2,6,2,8],[3,1,3,2],[3,4,3,5],[3,6,3,8],[4,0,4,1],[4,6,4,9],[5,6,6,6],[46,0,46,3],[47,0,47,3],[48,0,48,3],[53,0,53,2],[53,3,53,4],[53,7,53,9]]}
["ST. JOSEPH'S COLLEGE, MOOLAMATTOM (AUTONOMOUS)"]
["Academic Year",{"$f":"Sheet1!D2","v":"2024-2025"}]
["Course Code:",{"$f":"Sheet1!D3","v":"MG1DSCMA101"},null,null,"Name of the Course:",null,{"$f":"Sheet1!D6","v":"INTRODUCTION TO WEB DESIGNING\t\t"}]
["Semester:",{"$f":"Sheet1!D4","v":1},null,null,"Number of Course Outcomes:",null,{"$f":"Sheet1!D7","v":9}]
["CCA Component Type (Theory/Practical):",null,{"$f":"Sheet1!D5","v":"THEORY"}]
["CO Number","CO 1","CO 2","CO 3","CO 4","CO 5","Total Marks Allocated for CCA"]
["Evaluation Method(s) Used",{"$f":"Sheet1!A11&CHAR(10)&Sheet1!A12&CHAR(10)&Sheet1!A13&CHAR(10)&Sheet1!A14&CHAR(10)&Sheet1!A15","v":"\n\n\n\n"},{"$f":"Sheet1!D11&CHAR(10)&Sheet1!D12&CHAR(10)&Sheet1!D13&CHAR(10)&Sheet1!D14&CHAR(10)&Sheet1!D15","v":"\n\n\n\n"},{"$f":"Sheet1!G11&CHAR(10)&Sheet1!G12&CHAR(10)&Sheet1!G13&CHAR(10)&Sheet1!G14&CHAR(10)&Sheet1!G15","v":"\n\n\n\n"},{"$f":"Sheet1!J11&CHAR(10)&Sheet1!J12&CHAR(10)&Sheet1!J13&CHAR(10)&Sheet1!J14&CHAR(10)&Sheet1!J15","v":"\n\n\n\n"},{"$f":"Sheet1!M11&CHAR(10)&Sheet1!M12&CHAR(10)&Sheet1!M13&CHAR(10)&Sheet1!M14&CHAR(10)&Sheet1!M15","v":"\n\n\n\n"}]
["Maximum Marks Allocated",{"$f":"Sheet1!C16","v":0},{"$f":"Sheet1!F16","v":0},{"$f":"Sheet1!I16","v":0},{"$f":"Sheet1!L16","v":0},{"$f":"Sheet1!O16","v":0},{"$f":"Sheet1!D8","v":0}]
["SL. No.","Register Number","Name of the Student","Marks Obtained in CO 1","Marks Obtained in CO 2","Marks Obtained in CO 3","Marks Obtained in CO 4","Marks Obtained in CO 5","Total Marks Obtained in CCA"]
[{"$f":"IF(ISBLANK(Sheet1!A20),\" \",Sheet1!A20)","v":1},{"$f":"IF(ISBLANK(Sheet1!B20),\" \",Sheet1!B20)","v":" "},{"$f":"Sheet1!C20","v":0},{"$f":"IF(CCA_Form_A_Part_I!I9=0,\" \",CCA_Form_A_Part_I!I9)","v":" "},{"$f":"IF(CCA_Form_A_Part_I!O9=0,\" \",CCA_Form_A_Part_I!O9)","v":" "},{"$f":"IF(CCA_Form_A_Part_I!U9=0,\" \",CCA_Form_A_Part_I!U9)","v":" "},{"$f":"IF(CCA_Form_A_Part_I!AA9=0,\" \",CCA_Form_A_Part_I!AA9)","v":" "},{"$f":"IF(CCA_Form_A_Part_I!AG9=0,\" \",CCA_Form_A_Part_I!AG9)","v":" "},{"$f":"SUM(D10:H10)","v":{"v":0,"d":"0.00"}}]
[{"$f":"IF(ISBLANK(Sheet1!A21),\" \",Sheet1!A21)","v":2},{"$f":"IF(ISBLANK(Sheet1!B21),\" \",Sheet1!B21)","v":" "},{"$f":"IF(ISBLANK(Sheet1!C21),\" \",Sheet1!C21)","v":" "},{"$f":"IF(CCA_Form_A_Part_I!I10=0,\" \",CCA_Form_A_Part_I!I10)","v":" "},{"$f":"IF(CCA_Form_A_Part_I!O10=0,\" \",CCA_Form_A_Part_I!O10)","v":" "},{"$f":"IF(CCA_Form_A_Part_I!U10=0,\" \",CCA_Form_A_Part_I!U10)","v":" "},{"$f":"IF(CCA_Form_A_Part_I!AA10=0,\" \",CCA_Form_A_Part_I!AA10)","v":" "},{"$f":"IF(CCA_Form_A_Part_I!AG10=0,\" \",CCA_Form_A_Part_I!AG10)","v":" "},{"$f":"SUM(D11:H11)","v":{"v":0,"d":"0.00"}}]
[{"$f":"IF(ISBLANK(Sheet1!A22),\" \",Sheet1!A22)","v":3},{"$f":"IF(ISBLANK(Sheet1!B22),\" \",Sheet1!B22)","v":" "},{"$f":"IF(ISBLANK(Sheet1!C22),\" \",Sheet1!C22)","v":" "},{"$f":"IF(CCA_Form_A_Part_I!I11=0,\" \",CCA_Form_A_Part_I!I11)","v":" "},{"$f":"IF(CCA_Form_A_Part_I!O11=0,\" \",CCA_Form_A_Part_I!O11)","v":" "},{"$f":"IF(CCA_Form_A_Part_I!U11=0,\" \",CCA_Form_A_Part_I!U11)","v":" "},{"$f":"IF(CCA_Form_A_Part_I!AA11=0,\" \",CCA_Form_A_Part_I!AA11)","v":" "},{"$f":"IF(CCA_Form_A_Part_I!AG11=0,\" \",CCA_Form_A_Part_I!AG11)","v":" "},{"v":0,"d":"0.00"}]
[{"$f":"IF(ISBLANK(Sheet1!A23),\" \",Sheet1!A23)","v":4},{"$f":"IF(ISBLANK(Sheet1!B23),\" \",Sheet1!B23)","v":" "},{"$f":"IF(ISBLANK(Sheet1!C23),\" \",Sheet1!C23)","v":" "},{"$f":"IF(CCA_Form_A_Part_I!I12=0,\" \",CCA_Form_A_Part_I!I12)","v":" "},{"$f":"IF(CCA_Form_A_Part_I!O12=0,\" \",CCA_Form_A_Part_I!O12)","v":" "},{"$f":"IF(CCA_Form_A_Part_I!U12=0,\" \",CCA_Form_A_Part_I!U12)","v":" "},{"$f":"IF(CCA_Form_A_Part_I!AA12=0,\" \",CCA_Form_A_Part_I!AA12)","v":" "},{"$f":"IF(CCA_Form_A_Part_I!AG12=0,\" \",CCA_Form_A_Part_I!AG12)","v":" "},{"v":0,"d":"0.00"}]
[{"$f":"IF(ISBLANK(Sheet1!A24),\" \",Sheet1!A24)","v":5},{"$f":"IF(ISBLANK(Sheet1!B24),\" \",Sheet1!B24)","v":" "},{"$f":"IF(ISBLANK(Sheet1!C24),\" \",Sheet1!C24)","v":" "},{"$f":"IF(CCA_Form_A_Part_I!I13=0,\" \",CCA_Form_A_Part_I!I13)","v":" "},{"$f":"IF(CCA_Form_A_Part_I!O13=0,\" \",CCA_Form_A_Part_I!O13)","v":" "},{"$f":"IF(CCA_Form_A_Part_I!U13=0,\" \",CCA_Form_A_Part_I!U13)","v":" "},{"$f":"IF(CCA_Form_A_Part_I!AA13=0,\" \",CCA_Form_A_Part_I!AA13)","v":" "},{"$f":"IF(CCA_Form_A_Part_I!AG13=0,\" \",CCA_Form_A_Part_I!AG13)","v":" "},{"v":0,"d":"0.00"}]
[{"$f":"IF(ISBLANK(Sheet1!A25),\" \",Sheet1!A25)","v":6},{"$f":"IF(ISBLANK(Sheet1!B25),\" \",Sheet1!B25)","v":" "},{"$f":"IF(ISBLANK(Sheet1!C25),\" \",Sheet1!C25)","v":" "},{"$f":"IF(CCA_Form_A_Part_I!I14=0,\" \",CCA_Form_A_Part_I!I14)","v":" "},{"$f":"IF(CCA_Form_A_Part_I!O14=0,\" \",CCA_Form_A_Part_I!O14)","v":" "},{"$f":"IF(CCA_Form_A_Part_I!U14=0,\" \",CCA_Form_A_Part_I!U14)","v":" "},{"$f":"IF(CCA_Form_A_Part_I!AA14=0,\" \",CCA_Form_A_Part_I!AA14)","v":" "},{"$f":"IF(CCA_Form_A_Part_I!AG14=0,\" \",CCA_Form_A_Part_I!AG14)","v":" "},{"v":0,"d":"0.00"}]
[{"$f":"IF(ISBLANK(Sheet1!A26),\" \",Sheet1!A26)","v":7},{"$f":"IF(ISBLANK(Sheet1!B26),\" \",Sheet1!B26)","v":" "},{"$f":"IF(ISBLANK(Sheet1!C26),\" \",Sheet1!C26)","v":" "},{"$f":"IF(CCA_Form_A_Part_I!I15=0,\" \",CCA_Form_A_Part_I!I15)","v":" "},{"$f":"IF(CCA_Form_A_Part_I!O15=0,\" \",CCA_Form_A_Part_I!O15)","v":" "},{"$f":"IF(CCA_Form_A_Part_I!U15=0,\" \",CCA_Form_A_Part_I!U15)","v":" "},{"$f":"IF(CCA_Form_A_Part_I!AA15=0,\" \",CCA_Form_A_Part_I!AA15)","v":" "},{"$f":"IF(CCA_Form_A_Part_I!AG15=0,\" \",CCA_Form_A_Part_I!AG15)","v":" "},{"v":0,"d":"0.00"}]
[{"$f":"IF(ISBLANK(Sheet1!A27),\" \",Sheet1!A27)","v":8},{"$f":"IF(ISBLANK(Sheet1!B27),\" \",Sheet1!B27)","v":" "},{"$f":"IF(ISBLANK(Sheet1!C27),\" \",Sheet1!C27)","v":" "},{"$f":"IF(CCA_Form_A_Part_I!I16=0,\" \",CCA_Form_A_Part_I!I16)","v":" "},{"$f":"IF(CCA_Form_A_Part_I!O16=0,\" \",CCA_Form_A_Part_I!O16)","v":" "},{"$f":"IF(CCA_Form_A_Part_I!U16=0,\" \",CCA_Form_A_Part_I!U16)","v":" "},{"$f":"IF(CCA_Form_A_Part_I!AA16=0,\" \",CCA_Form_A_Part_I!AA16)","v":" "},{"$f":"IF(CCA_Form_A_Part_I!AG16=0,\" \",CCA_Form_A_Part_I!AG16)","v":" "},{"v":0,"d":"0.00"}]
[{"$f":"IF(ISBLANK(Sheet1!A28),\" \",Sheet1!A28)","v":9},{"$f":"IF(ISBLANK(Sheet1!B28),\" \",Sheet1!B28)","v":" "},{"$f":"IF(ISBLANK(Sheet1!C28),\" \",Sheet1!C28)","v":" "},{"$f":"IF(CCA_Form_A_Part_I!I17=0,\" \",CCA_Form_A_Part_I!I17)","v":" "},{"$f":"IF(CCA_Form_A_Part_I!O17=0,\" \",CCA_Form_A_Part_I!O17)","v":" "},{"$f":"IF(CCA_Form_A_Part_I!U17=0,\" \",CCA_Form_A_Part_I!U17)","v":" "},{"$f":"IF(CCA_Form_A_Part_I!AA17=0,\" \",CCA_Form_A_Part_I!AA17)","v":" "},{"$f":"IF(CCA_Form_A_Part_I!AG17=0,\" \",CCA_Form_A_Part_I!AG17)","v":" "},{"v":0,"d":"0.00"}]
[{"$f":"IF(ISBLANK(Sheet1!A29),\" \",Sheet1!A29)","v":10},{"$f":"IF(ISBLANK(Sheet1!B29),\" \",Sheet1!B29)","v":" "},{"$f":"IF(ISBLANK(Sheet1!C29),\" \",Sheet1!C29)","v":" "},{"$f":"IF(CCA_Form_A_Part_I!I18=0,\" \",CCA_Form_A_Part_I!I18)","v":" "},{"$f":"IF(CCA_Form_A_Part_I!O18=0,\" \",CCA_Form_A_Part_I!O18)","v":" "},{"$f":"IF(CCA_Form_A_Part_I!U18=0,\" \",CCA_Form_A_Part_I!U18)","v":" "},{"$f":"IF(CCA_Form_A_Part_I!AA18=0,\" \",CCA_Form_A_Part_I!AA18)","v":" "},{"$f":"IF(CCA_Form_A_Part_I!AG18=0,\" \",CCA_Form_A_Part_I!AG18)","v":" "},{"v":0,"d":"0.00"}]
[{"$f":"IF(ISBLANK(Sheet1!A30),\" \",Sheet1!A30)","v":11},{"$f":"IF(ISBLANK(Sheet1!B30),\" \",Sheet1!B30)","v":" "},{"$f":"IF(ISBLANK(Sheet1!C30),\" \",Sheet1!C30)","v":" "},{"$f":"IF(CCA_Form_A_Part_I!I19=0,\" \",CCA_Form_A_Part_I!I19)","v":" "},{"$f":"IF(CCA_Form_A_Part_I!O19=0,\" \",CCA_Form_A_Part_I!O19)","v":" "},{"$f":"IF(CCA_Form_A_Part_I!U19=0,\" \",CCA_Form_A_Part_I!U19)","v":" "},{"$f":"IF(CCA_Form_A_Part_I!AA19=0,\" \",CCA_Form_A_Part_I!AA19)","v":" "},{"$f":"IF(CCA_Form_A_Part_I!AG19=0,\" \",CCA_Form_A_Part_I!AG19)","v":" "},{"v":0,"d":"0.00"}]
[{"$f":"IF(ISBLANK(Sheet1!A31),\" \",Sheet1!A31)","v":12},{"$f":"IF(ISBLANK(Sheet1!B31),\" \",Sheet1!B31)","v":" "},{"$f":"IF(ISBLANK(Sheet1!C31),\" \",Sheet1!C31)","v":" "},{"$f":"IF(CCA_Form_A_Part_I!I20=0,\" \",CCA_Form_A_Part_I!I20)","v":" "},{"$f":"IF(CCA_Form_A_Part_I!O20=0,\" \",CCA_Form_A_Part_I!O20)","v":" "},{"$f":"IF(CCA_Form_A_Part_I!U20=0,\" \",CCA_Form_A_Part_I!U20)","v":" "},{"$f":"IF(CCA_Form_A_Part_I!AA20=0,\" \",CCA_Form_A_Part_I!AA20)","v":" "},{"$f":"IF(CCA_Form_A_Part_I!AG20=0,\" \",CCA_Form_A_Part_I!AG20)","v":" "},{"v":0,"d":"0.00"}]
[{"$f":"IF(ISBLANK(Sheet1!A32),\" \",Sheet1!A32)","v":13},{"$f":"IF(ISBLANK(Sheet1!B32),\" \",Sheet1!B32)","v":" "},{"$f":"IF(ISBLANK(Sheet1!C32),\" \",Sheet1!C32)","v":" "},{"$f":"IF(CCA_Form_A_Part_I!I21=0,\" \",CCA_Form_A_Part_I!I21)","v":" "},{"$f":"IF(CCA_Form_A_Part_I!O21=0,\" \",CCA_Form_A_Part_I!O21)","v":" "},{"$f":"IF(CCA_Form_A_Part_I!U21=0,\" \",CCA_Form_A_Part_I!U21)","v":" "},{"$f":"IF(CCA_Form_A_Part_I!AA21=0,\" \",CCA_Form_A_Part_I!AA21)","v":" "},{"$f":"IF(CCA_Form_A_Part_I!AG21=0,\" \",CCA_Form_A_Part_I!AG21)","v":" "},{"v":0,"d":"0.00"}]
[{"$f":"IF(ISBLANK(Sheet1!A33),\" \",Sheet1!A33)","v":14},{"$f":"IF(ISBLANK(Sheet1!B33),\" \",Sheet1!B33)","v":" "},{"$f":"IF(ISBLANK(Sheet1!C33),\" \",Sheet1!C33)","v":" "},{"$f":"IF(CCA_Form_A_Part_I!I22=0,\" \",CCA_Form_A_Part_I!I22)","v":" "},{"$f":"IF(CCA_Form_A_Part_I!O22=0,\" \",CCA_Form_A_Part_I!O22)","v":" "},{"$f":"IF(CCA_Form_A_Part_I!U22=0,\" \",CCA_Form_A_Part_I!U22)","v":" "},{"$f":"IF(CCA_Form_A_Part_I!AA22=0,\" \",CCA_Form_A_Part_I!AA22)","v":" "},{"$f":"IF(CCA_Form_A_Part_I!AG22=0,\" \",CCA_Form_A_Part_I!AG22)","v":" "},{"v":0,"d":"0.00"}]
[{"$f":"IF(ISBLANK(Sheet1!A34),\" \",Sheet1!A34)","v":15},{"$f":"IF(ISBLANK(Sheet1!B34),\" \",Sheet1!B34)","v":" "},{"$f":"IF(ISBLANK(Sheet1!C34),\" \",Sheet1!C34)","v":" "},{"$f":"IF(CCA_Form_A_Part_I!I23=0,\" \",CCA_Form_A_Part_I!I23)","v":" "},{"$f":"IF(CCA_Form_A_Part_I!O23=0,\" \",CCA_Form_A_Part_I!O23)","v":" "},{"$f":"IF(CCA_Form_A_Part_I!U23=0,\" \",CCA_Form_A_Part_I!U23)","v":" "},{"$f":"IF(CCA_Form_A_Part_I!AA23=0,\" \",CCA_Form_A_Part_I!AA23)","v":" "},{"$f":"IF(CCA_Form_A_Part_I!AG23=0,\" \",CCA_Form_A_Part_I!AG23)","v":" "},{"v":0,"d":"0.00"}]
[{"$f":"IF(ISBLANK(Sheet1!A35),\" \",Sheet1!A35)","v":16},{"$f":"IF(ISBLANK(Sheet1!B35),\" \",Sheet1!B35)","v":" "},{"$f":"IF(ISBLANK(Sheet1!C35),\" \",Sheet1!C35)","v":" "},{"$f":"IF(CCA_Form_A_Part_I!I24=0,\" \",CCA_Form_A_Part_I!I24)","v":" "},{"$f":"IF(CCA_Form_A_Part_I!O24=0,\" \",CCA_Form_A_Part_I!O24)","v":" "},{"$f":"IF(CCA_Form_A_Part_I!U24=0,\" \",CCA_Form_A_Part_I!U24)","v":" "},{"$f":"IF(CCA_Form_A_Part_I!AA24=0,\" \",CCA_Form_A_Part_I!AA24)","v":" "},{"$f":"IF(CCA_Form_A_Part_I!AG24=0,\" \",CCA_Form_A_Part_I!AG24)","v":" "},{"v":0,"d":"0.00"}]
[{"$f":"IF(ISBLANK(Sheet1!A36),\" \",Sheet1!A36)","v":17},{"$f":"IF(ISBLANK(Sheet1!B36),\" \",Sheet1!B36)","v":" "},{"$f":"IF(ISBLANK(Sheet1!C36),\" \",Sheet1!C36)","v":" "},{"$f":"IF(CCA_Form_A_Part_I!I25=0,\" \",CCA_Form_A_Part_I!I25)","v":" "},{"$f":"IF(CCA_Form_A_Part_I!O25=0,\" \",CCA_Form_A_Part_I!O25)","v":" "},{"$f":"IF(CCA_Form_A_Part_I!U25=0,\" \",CCA_Form_A_Part_I!U25)","v":" "},{"$f":"IF(CCA_Form_A_Part_I!AA25=0,\" \",CCA_Form_A_Part_I!AA25)","v":" "},{"$f":"IF(CCA_Form_A_Part_I!AG25=0,\" \",CCA_Form_A_Part_I!AG25)","v":" "},{"v":0,"d":"0.00"}]
[{"$f":"IF(ISBLANK(Sheet1!A37),\" \",Sheet1!A37)","v":18},{"$f":"IF(ISBLANK(Sheet1!B37),\" \",Sheet1!B37)","v":" "},{"$f":"IF(ISBLANK(Sheet1!C37),\" \",Sheet1!C37)","v":" "},{"$f":"IF(CCA_Form_A_Part_I!I26=0,\" \",CCA_Form_A_Part_I!I26)","v":" "},{"$f":"IF(CCA_Form_A_Part_I!O26=0,\" \",CCA_Form_A_Part_I!O26)","v":" "},{"$f":"IF(CCA_Form_A_Part_I!U26=0,\" \",CCA_Form_A_Part_I!U26)","v":" "},{"$f":"IF(CCA_Form_A_Part_I!AA26=0,\" \",CCA_Form_A_Part_I!AA26)","v":" "},{"$f":"IF(CCA_Form_A_Part_I!AG26=0,\" \",CCA_Form_A_Part_I!AG26)","v":" "},{"v":0,"d":"0.00"}]
[{"$f":"IF(ISBLANK(Sheet1!A38),\" \",Sheet1!A38)","v":19},{"$f":"IF(ISBLANK(Sheet1!B38),\" \",Sheet1!B38)","v":" "},{"$f":"IF(ISBLANK(Sheet1!C38),\" \",Sheet1!C38)","v":" "},{"$f":"IF(CCA_Form_A_Part_I!I27=0,\" \",CCA_Form_A_Part_I!I27)","v":" "},{"$f":"IF(CCA_Form_A_Part_I!O27=0,\" \",CCA_Form_A_Part_I!O27)","v":" "},{"$f":"IF(CCA_Form_A_Part_I!U27=0,\" \",CCA_Form_A_Part_I!U27)","v":" "},{"$f":"IF(CCA_Form_A_Part_I!AA27=0,\" \",CCA_Form_A_Part_I!AA27)","v":" "},{"$f":"IF(CCA_Form_A_Part_I!AG27=0,\" \",CCA_Form_A_Part_I!AG27)","v":" "},{"v":0,"d":"0.00"}]
[{"$f":"IF(ISBLANK(Sheet1!A39),\" \",Sheet1!A39)","v":20},{"$f":"IF(ISBLANK(Sheet1!B39),\" \",Sheet1!B39)","v":" "},{"$f":"IF(ISBLANK(Sheet1!C39),\" \",Sheet1!C39)","v":" "},{"$f":"IF(CCA_Form_A_Part_I!I28=0,\" \",CCA_Form_A_Part_I!I28)","v":" "},{"$f":"IF(CCA_Form_A_Part_I!O28=0,\" \",CCA_Form_A_Part_I!O28)","v":" "},{"$f":"IF(CCA_Form_A_Part_I!U28=0,\" \",CCA_Form_A_Part_I!U28)","v":" "},{"$f":"IF(CCA_Form_A_Part_I!AA28=0,\" \",CCA_Form_A_Part_I!AA28)","v":" "},{"$f":"IF(CCA_Form_A_Part_I!AG28=0,\" \",CCA_Form_A_Part_I!AG28)","v":" "},{"v":0,"d":"0.00"}]
[{"$f":"IF(ISBLANK(Sheet1!A40),\" \",Sheet1!A40)","v":21},{"$f":"IF(ISBLANK(Sheet1!B40),\" \",Sheet1!B40)","v":" "},{"$f":"IF(ISBLANK(Sheet1!C40),\" \",Sheet1!C40)","v":" "},{"$f":"IF(CCA_Form_A_Part_I!I29=0,\" \",CCA_Form_A_Part_I!I29)","v":" "},{"$f":"IF(CCA_Form_A_Part_I!O29=0,\" \",CCA_Form_A_Part_I!O29)","v":" "},{"$f":"IF(CCA_Form_A_Part_I!U29=0,\" \",CCA_Form_A_Part_I!U29)","v":" "},{"$f":"IF(CCA_Form_A_Part_I!AA29=0,\" \",CCA_Form_A_Part_I!AA29)","v":" "},{"$f":"IF(CCA_Form_A_Part_I!AG29=0,\" \",CCA_Form_A_Part_I!AG29)","v":" "},{"v":0,"d":"0.00"}]
[{"$f":"IF(ISBLANK(Sheet1!A41),\" \",Sheet1!A41)","v":22},{"$f":"IF(ISBLANK(Sheet1!B41),\" \",Sheet1!B41)","v":" "},{"$f":"IF(ISBLANK(Sheet1!C41),\" \",Sheet1!C41)","v":" "},{"$f":"IF(CCA_Form_A_Part_I!I30=0,\" \",CCA_Form_A_Part_I!I30)","v":" "},{"$f":"IF(CCA_Form_A_Part_I!O30=0,\" \",CCA_Form_A_Part_I!O30)","v":" "},{"$f":"IF(CCA_Form_A_Part_I!U30=0,\" \",CCA_Form_A_Part_I!U30)","v":" "},{"$f":"IF(CCA_Form_A_Part_I!AA30=0,\" \",CCA_Form_A_Part_I!AA30)","v":" "},{"$f":"IF(CCA_Form_A_Part_I!AG30=0,\" \",CCA_Form_A_Part_I!AG30)","v":" "},{"v":0,"d":"0.00"}]
[{"$f":"IF(ISBLANK(Sheet1!A42),\" \",Sheet1!A42)","v":23},{"$f":"IF(ISBLANK(Sheet1!B42),\" \",Sheet1!B42)","v":" "},{"$f":"IF(ISBLANK(Sheet1!C42),\" \",Sheet1!C42)","v":" "},{"$f":"IF(CCA_Form_A_Part_I!I31=0,\" \",CCA_Form_A_Part_I!I31)","v":" "},{"$f":"IF(CCA_Form_A_Part_I!O31=0,\" \",CCA_Form_A_Part_I!O31)","v":" "},{"$f":"IF(CCA_Form_A_Part_I!U31=0,\" \",CCA_Form_A_Part_I!U31)","v":" "},{"$f":"IF(CCA_Form_A_Part_I!AA31=0,\" \",CCA_Form_A_Part_I!AA31)","v":" "},{"$f":"IF(CCA_Form_A_Part_I!AG31=0,\" \",CCA_Form_A_Part_I!AG31)","v":" "},{"v":0,"d":"0.00"}]
[{"$f":"IF(ISBLANK(Sheet1!A43),\" \",Sheet1!A43)","v":24},{"$f":"IF(ISBLANK(Sheet1!B43),\" \",Sheet1!B43)","v":" "},{"$f":"IF(ISBLANK(Sheet1!C43),\" \",Sheet1!C43)","v":" "},{"$f":"IF(CCA_Form_A_Part_I!I32=0,\" \",CCA_Form_A_Part_I!I32)","v":" "},{"$f":"IF(CCA_Form_A_Part_I!O32=0,\" \",CCA_Form_A_Part_I!O32)","v":" "},{"$f":"IF(CCA_Form_A_Part_I!U32=0,\" \",CCA_Form_A_Part_I!U32)","v":" "},{"$f":"IF(CCA_Form_A_Part_I!AA32=0,\" \",CCA_Form_A_Part_I!AA32)","v":" "},{"$f":"IF(CCA_Form_A_Part_I!AG32=0,\" \",CCA_Form_A_Part_I!AG32)","v":" "},{"v":0,"d":"0.00"}]
[{"$f":"IF(ISBLANK(Sheet1!A44),\" \",Sheet1!A44)","v":25},{"$f":"IF(ISBLANK(Sheet1!B44),\" \",Sheet1!B44)","v":" "},{"$f":"IF(ISBLANK(Sheet1!C44),\" \",Sheet1!C44)","v":" "},{"$f":"IF(CCA_Form_A_Part_I!I33=0,\" \",CCA_Form_A_Part_I!I33)","v":" "},{"$f":"IF(CCA_Form_A_Part_I!O33=0,\" \",CCA_Form_A_Part_I!O33)","v":" "},{"$f":"IF(CCA_Form_A_Part_I!U33=0,\" \",CCA_Form_A_Part_I!U33)","v":" "},{"$f":"IF(CCA_Form_A_Part_I!AA33=0,\" \",CCA_Form_A_Part_I!AA33)","v":" "},{"$f":"IF(CCA_Form_A_Part_I!AG33=0,\" \",CCA_Form_A_Part_I!AG33)","v":" "},{"v":0,"d":"0.00"}]
[{"$f":"IF(ISBLANK(Sheet1!A45),\" \",Sheet1!A45)","v":26},{"$f":"IF(ISBLANK(Sheet1!B45),\" \",Sheet1!B45)","v":" "},{"$f":"IF(ISBLANK(Sheet1!C45),\" \",Sheet1!C45)","v":" "},{"$f":"IF(CCA_Form_A_Part_I!I34=0,\" \",CCA_Form_A_Part_I!I34)","v":" "},{"$f":"IF(CCA_Form_A_Part_I!O34=0,\" \",CCA_Form_A_Part_I!O34)","v":" "},{"$f":"IF(CCA_Form_A_Part_I!U34=0,\" \",CCA_Form_A_Part_I!U34)","v":" "},{"$f":"IF(CCA_Form_A_Part_I!AA34=0,\" \",CCA_Form_A_Part_I!AA34)","v":" "},{"$f":"IF(CCA_Form_A_Part_I!AG34=0,\" \",CCA_Form_A_Part_I!AG34)","v":" "},{"v":0,"d":"0.00"}]
[{"$f":"IF(ISBLANK(Sheet1!A46),\" \",Sheet1!A46)","v":27},{"$f":"IF(ISBLANK(Sheet1!B46),\" \",Sheet1!B46)","v":" "},{"$f":"IF(ISBLANK(Sheet1!C46),\" \",Sheet1!C46)","v":" "},{"$f":"IF(CCA_Form_A_Part_I!I35=0,\" \",CCA_Form_A_Part_I!I35)","v":" "},{"$f":"IF(CCA_Form_A_Part_I!O35=0,\" \",CCA_Form_A_Part_I!O35)","v":" "},{"$f":"IF(CCA_Form_A_Part_I!U35=0,\" \",CCA_Form_A_Part_I!U35)","v":" "},{"$f":"IF(CCA_Form_A_Part_I!AA35=0,\" \",CCA_Form_A_Part_I!AA35)","v":" "},{"$f":"IF(CCA_Form_A_Part_I!AG35=0,\" \",CCA_Form_A_Part_I!AG35)","v":" "},{"v":0,"d":"0.00"}]
[{"$f":"IF(ISBLANK(Sheet1!A47),\" \",Sheet1!A47)","v":28},{"$f":"IF(ISBLANK(Sheet1!B47),\" \",Sheet1!B47)","v":" "},{"$f":"IF(ISBLANK(Sheet1!C47),\" \",Sheet1!C47)","v":" "},{"$f":"IF(CCA_Form_A_Part_I!I36=0,\" \",CCA_Form_A_Part_I!I36)","v":" "},{"$f":"IF(CCA_Form_A_Part_I!O36=0,\" \",CCA_Form_A_Part_I!O36)","v":" "},{"$f":"IF(CCA_Form_A_Part_I!U36=0,\" \",CCA_Form_A_Part_I!U36)","v":" "},{"$f":"IF(CCA_Form_A_Part_I!AA36=0,\" \",CCA_Form_A_Part_I!AA36)","v":" "},{"$f":"IF(CCA_Form_A_Part_I!AG36=0,\" \",CCA_Form_A_Part_I!AG36)","v":" "},{"v":0,"d":"0.00"}]
[{"$f":"IF(ISBLANK(Sheet1!A48),\" \",Sheet1!A48)","v":29},{"$f":"IF(ISBLANK(Sheet1!B48),\" \",Sheet1!B48)","v":" "},{"$f":"IF(ISBLANK(Sheet1!C48),\" \",Sheet1!C48)","v":" "},{"$f":"IF(CCA_Form_A_Part_I!I37=0,\" \",CCA_Form_A_Part_I!I37)","v":" "},{"$f":"IF(CCA_Form_A_Part_I!O37=0,\" \",CCA_Form_A_Part_I!O37)","v":" "},{"$f":"IF(CCA_Form_A_Part_I!U37=0,\" \",CCA_Form_A_Part_I!U37)","v":" "},{"$f":"IF(CCA_Form_A_Part_I!AA37=0,\" \",CCA_Form_A_Part_I!AA37)","v":" "},{"$f":"IF(CCA_Form_A_Part_I!AG37=0,\" \",CCA_Form_A_Part_I!AG37)","v":" "},{"v":0,"d":"0.00"}]
[{"$f":"IF(ISBLANK(Sheet1!A49),\" \",Sheet1!A49)","v":30},{"$f":"IF(ISBLANK(Sheet1!B49),\" \",Sheet1!B49)","v":" "},{"$f":"IF(ISBLANK(Sheet1!C49),\" \",Sheet1!C49)","v":" "},{"$f":"IF(CCA_Form_A_Part_I!I38=0,\" \",CCA_Form_A_Part_I!I38)","v":" "},{"$f":"IF(CCA_Form_A_Part_I!O38=0,\" \",CCA_Form_A_Part_I!O38)","v":" "},{"$f":"IF(CCA_Form_A_Part_I!U38=0,\" \",CCA_Form_A_Part_I!U38)","v":" "},{"$f":"IF(CCA_Form_A_Part_I!AA38=0,\" \",CCA_Form_A_Part_I!AA38)","v":" "},{"$f":"IF(CCA_Form_A_Part_I!AG38=0,\" \",CCA_Form_A_Part_I!AG38)","v":" "},{"v":0,"d":"0.00"}]
[{"$f":"IF(ISBLANK(Sheet1!A50),\" \",Sheet1!A50)","v":31},{"$f":"IF(ISBLANK(Sheet1!B50),\" \",Sheet1!B50)","v":" "},{"$f":"IF(ISBLANK(Sheet1!C50),\" \",Sheet1!C50)","v":" "},{"$f":"IF(CCA_Form_A_Part_I!I39=0,\" \",CCA_Form_A_Part_I!I39)","v":" "},{"$f":"IF(CCA_Form_A_Part_I!O39=0,\" \",CCA_Form_A_Part_I!O39)","v":" "},{"$f":"IF(CCA_Form_A_Part_I!U39=0,\" \",CCA_Form_A_Part_I!U39)","v":" "},{"$f":"IF(CCA_Form_A_Part_I!AA39=0,\" \",CCA_Form_A_Part_I!AA39)","v":" "},{"$f":"IF(CCA_Form_A_Part_I!AG39=0,\" \",CCA_Form_A_Part_I!AG39)","v":" "},{"v":0,"d":"0.00"}]
[{"$f":"IF(ISBLANK(Sheet1!A51),\" \",Sheet1!A51)","v":32},{"$f":"IF(ISBLANK(Sheet1!B51),\" \",Sheet1!B51)","v":" "},{"$f":"IF(ISBLANK(Sheet1!C51),\" \",Sheet1!C51)","v":" "},{"$f":"IF(CCA_Form_A_Part_I!I40=0,\" \",CCA_Form_A_Part_I!I40)","v":" "},{"$f":"IF(CCA_Form_A_Part_I!O40=0,\" \",CCA_Form_A_Part_I!O40)","v":" "},{"$f":"IF(CCA_Form_A_Part_I!U40=0,\" \",CCA_Form_A_Part_I!U40)","v":" "},{"$f":"IF(CCA_Form_A_Part_I!AA40=0,\" \",CCA_Form_A_Part_I!AA40)","v":" "},{"$f":"IF(CCA_Form_A_Part_I!AG40=0,\" \",CCA_Form_A_Part_I!AG40)","v":" "},{"v":0,"d":"0.00"}]
[{"$f":"IF(ISBLANK(Sheet1!A52),\" \",Sheet1!A52)","v":33},{"$f":"IF(ISBLANK(Sheet1!B52),\" \",Sheet1!B52)","v":" "},{"$f":"IF(ISBLANK(Sheet1!C52),\" \",Sheet1!C52)","v":" "},{"$f":"IF(CCA_Form_A_Part_I!I41=0,\" \",CCA_Form_A_Part_I!I41)","v":" "},{"$f":"IF(CCA_Form_A_Part_I!O41=0,\" \",CCA_Form_A_Part_I!O41)","v":" "},{"$f":"IF(CCA_Form_A_Part_I!U41=0,\" \",CCA_Form_A_Part_I!U41)","v":" "},{"$f":"IF(CCA_Form_A_Part_I!AA41=0,\" \",CCA_Form_A_Part_I!AA41)","v":" "},{"$f":"IF(CCA_Form_A_Part_I!AG41=0,\" \",CCA_Form_A_Part_I!AG41)","v":" "},{"v":0,"d":"0.00"}]
[{"$f":"IF(ISBLANK(Sheet1!A53),\" \",Sheet1!A53)","v":34},{"$f":"IF(ISBLANK(Sheet1!B53),\" \",Sheet1!B53)","v":" "},{"$f":"IF(ISBLANK(Sheet1!C53),\" \",Sheet1!C53)","v":" "},{"$f":"IF(CCA_Form_A_Part_I!I42=0,\" \",CCA_Form_A_Part_I!I42)","v":" "},{"$f":"IF(CCA_Form_A_Part_I!O42=0,\" \",CCA_Form_A_Part_I!O42)","v":" "},{"$f":"IF(CCA_Form_A_Part_I!U42=0,\" \",CCA_Form_A_Part_I!U42)","v":" "},{"$f":"IF(CCA_Form_A_Part_I!AA42=0,\" \",CCA_Form_A_Part_I!AA42)","v":" "},{"$f":"IF(CCA_Form_A_Part_I!AG42=0,\" \",CCA_Form_A_Part_I!AG42)","v":" "},{"v":0,"d":"0.00"}]
[{"$f":"IF(ISBLANK(Sheet1!A54),\" \",Sheet1!A54)","v":35},{"$f":"IF(ISBLANK(Sheet1!B54),\" \",Sheet1!B54)","v":" "},{"$f":"IF(ISBLANK(Sheet1!C54),\" \",Sheet1!C54)","v":" "},{"$f":"IF(CCA_Form_A_Part_I!I43=0,\" \",CCA_Form_A_Part_I!I43)","v":" "},{"$f":"IF(CCA_Form_A_Part_I!O43=0,\" \",CCA_Form_A_Part_I!O43)","v":" "},{"$f":"IF(CCA_Form_A_Part_I!U43=0,\" \",CCA_Form_A_Part_I!U43)","v":" "},{"$f":"IF(CCA_Form_A_Part_I!AA43=0,\" \",CCA_Form_A_Part_I!AA43)","v":" "},{"$f":"IF(CCA_Form_A_Part_I!AG43=0,\" \",CCA_Form_A_Part_I!AG43)","v":" "},{"v":0,"d":"0.00"}]
[]
["Certified that,"]
["(1) The entries are verified with the records and there is no error or omission."]
["(2) These assessments were published and no grievances are pending."]
["(3) No error(s) is/are shown in the CCA Form A Part I and CCA Form A Part II."]
[]
[]
[]
[]
["Course Faculty/Course Coordinator",null,null,"HoD",{"$nulls":3},"Principal"]